BDBM50262507 3-((R)-3-((3-(2-chloro-4-fluorophenyl)-1,2,4-oxadiazol-5-yl)methyl)pyrrolidin-1-yl)quinoline::CHEMBL478202
SMILES: Fc1ccc(-c2noc(C[C@H]3CCN(C3)c3cnc4ccccc4c3)n2)c(Cl)c1
InChI Key: InChIKey=AEKOYIYPZKHXPB-CQSZACIVSA-N
Data: 2 EC50
Activity Spreadsheet -- Enzyme Inhibition Constant Data from BindingDB
Found 2 hits for monomerid = 50262507
Trg + Lig
Ki
nM
ΔG°
kcal/mole
IC50
nM
Kd
nM
EC50/IC50
nM
koff
s-1
kon
M-1s-1
pHTemp
°C
Cannabinoid receptor 2
(Homo sapiens (Human))
BDBM50262507
(3-((R)-3-((3-(2-chloro-4-fluorophenyl)-1,2,4-oxadi...)
Show SMILES Fc1ccc(-c2noc(C[C@H]3CCN(C3)c3cnc4ccccc4c3)n2)c(Cl)c1 |r|
Show InChI InChI=1S/C22H18ClFN4O/c23-19-11-16(24)5-6-18(19)22-26-21(29-27-22)9-14-7-8-28(13-14)17-10-15-3-1-2-4-20(15)25-12-17/h1-6,10-12,14H,7-9,13H2/t14-/m1/s1
Reactome pathway
n/an/an/an/a 140n/an/an/an/a
Amgen Inc.
Curated by ChEMBL
Assay Description
Agonist activity at human CB2 receptor expressed in insect Sf9 cells assessed as effect on Eu-GTP binding
Bioorg Med Chem Lett 18: 4267-74 (2008)
Article DOI: 10.1016/j.bmcl.2008.06.096
BindingDB Entry DOI: 10.7270/Q21C1WQ8
Cannabinoid receptor 1
(Homo sapiens (Human))
BDBM50262507
(3-((R)-3-((3-(2-chloro-4-fluorophenyl)-1,2,4-oxadi...)
Show SMILES Fc1ccc(-c2noc(C[C@H]3CCN(C3)c3cnc4ccccc4c3)n2)c(Cl)c1 |r|
Show InChI InChI=1S/C22H18ClFN4O/c23-19-11-16(24)5-6-18(19)22-26-21(29-27-22)9-14-7-8-28(13-14)17-10-15-3-1-2-4-20(15)25-12-17/h1-6,10-12,14H,7-9,13H2/t14-/m1/s1
NCI pathway
Reactome pathway
n/an/an/an/a 1.69E+3n/an/an/an/a
Amgen Inc.
Curated by ChEMBL
Assay Description
Agonist activity at human CB1 receptor expressed in insect Sf9 cells assessed as effect on Eu-GTP binding
Bioorg Med Chem Lett 18: 4267-74 (2008)
Article DOI: 10.1016/j.bmcl.2008.06.096
BindingDB Entry DOI: 10.7270/Q21C1WQ8