BDBM50262604 4-(4-methyl-1H-indol-5-ylamino)-2-(3-(pyrrolidine-1-carbonyl)phenyl)thieno[2,3-b]pyridine-5-carbonitrile::CHEMBL476746
SMILES: Cc1c(Nc2c(cnc3sc(cc23)-c2cccc(c2)C(=O)N2CCCC2)C#N)ccc2[nH]ccc12
InChI Key: InChIKey=MPKJLCGWZCOAHC-UHFFFAOYSA-N
Data: 2 IC50
Activity Spreadsheet -- Enzyme Inhibition Constant Data from BindingDB
Found 2 hits for monomerid = 50262604
Trg + Lig
Ki
nM
ΔG°
kcal/mole
IC50
nM
Kd
nM
EC50/IC50
nM
koff
s-1
kon
M-1s-1
pHTemp
°C
Protein kinase C theta type
(Homo sapiens (Human))
BDBM50262604
(4-(4-methyl-1H-indol-5-ylamino)-2-(3-(pyrrolidine-...)
Show SMILES Cc1c(Nc2c(cnc3sc(cc23)-c2cccc(c2)C(=O)N2CCCC2)C#N)ccc2[nH]ccc12
Show InChI InChI=1S/C28H23N5OS/c1-17-21-9-10-30-24(21)8-7-23(17)32-26-20(15-29)16-31-27-22(26)14-25(35-27)18-5-4-6-19(13-18)28(34)33-11-2-3-12-33/h4-10,13-14,16,30H,2-3,11-12H2,1H3,(H,31,32)
NCI pathway
Reactome pathway
n/an/a 58n/an/an/an/an/an/a
Wyeth Research
Curated by ChEMBL
Assay Description
Inhibition of PKCtheta
Bioorg Med Chem Lett 18: 4420-3 (2008)
Article DOI: 10.1016/j.bmcl.2008.06.040
BindingDB Entry DOI: 10.7270/Q2WS8T2G
Protein kinase C delta type
(Homo sapiens (Human))
BDBM50262604
(4-(4-methyl-1H-indol-5-ylamino)-2-(3-(pyrrolidine-...)
Show SMILES Cc1c(Nc2c(cnc3sc(cc23)-c2cccc(c2)C(=O)N2CCCC2)C#N)ccc2[nH]ccc12
Show InChI InChI=1S/C28H23N5OS/c1-17-21-9-10-30-24(21)8-7-23(17)32-26-20(15-29)16-31-27-22(26)14-25(35-27)18-5-4-6-19(13-18)28(34)33-11-2-3-12-33/h4-10,13-14,16,30H,2-3,11-12H2,1H3,(H,31,32)
NCI pathway
Reactome pathway
n/an/a 180n/an/an/an/an/an/a
Wyeth Research
Curated by ChEMBL
Assay Description
Inhibition of PKCdelta
Bioorg Med Chem Lett 18: 4420-3 (2008)
Article DOI: 10.1016/j.bmcl.2008.06.040
BindingDB Entry DOI: 10.7270/Q2WS8T2G