null
SMILES: COc1ccc-2c(Cc3sc(NC(=O)c4cccs4)nc-23)c1
InChI Key: InChIKey=ICJHKBYQTSPGFA-UHFFFAOYSA-N
Activity Spreadsheet -- Enzyme Inhibition Constant Data from BindingDB
Found 4 hits for monomerid = 50262667
Trg + Lig
Ki
nM
ΔG°
kcal/mole
IC50
nM
Kd
nM
EC50/IC50
nM
koff
s-1
kon
M-1s-1
pHTemp
°C
Tyrosine-protein kinase ABL1
(Homo sapiens (Human))
BDBM50262667
(CHEMBL477139 | N-(6-methoxy-8H-indeno[1,2-d]thiazo...)
Show SMILES COc1ccc-2c(Cc3sc(NC(=O)c4cccs4)nc-23)c1
Show InChI InChI=1S/C16H12N2O2S2/c1-20-10-4-5-11-9(7-10)8-13-14(11)17-16(22-13)18-15(19)12-3-2-6-21-12/h2-7H,8H2,1H3,(H,17,18,19)
Reactome pathway
68n/an/an/an/an/an/an/an/a
Università degli Studi di Siena
Curated by ChEMBL
Assay Description
Inhibition of Abl kinase (unknown origin) by cell free assay
Bioorg Med Chem Lett 18: 4328-31 (2008)
Article DOI: 10.1016/j.bmcl.2008.06.082
BindingDB Entry DOI: 10.7270/Q2M908GW
Caspase-9
(Homo sapiens (Human))
BDBM50262667
(CHEMBL477139 | N-(6-methoxy-8H-indeno[1,2-d]thiazo...)
Show SMILES COc1ccc-2c(Cc3sc(NC(=O)c4cccs4)nc-23)c1
Show InChI InChI=1S/C16H12N2O2S2/c1-20-10-4-5-11-9(7-10)8-13-14(11)17-16(22-13)18-15(19)12-3-2-6-21-12/h2-7H,8H2,1H3,(H,17,18,19)
NCI pathway
Reactome pathway
PCBioAssay
n/an/a 1.19E+4n/an/an/an/an/an/a
Burnham Center for Chemical Genomics
Curated by PubChem BioAssay
Assay Description
Data Source: Sanford-Burnham Center for Chemical Genomics (SBCCG) Source Affiliation: Sanford-Burnham Medical Research Institute (SBIMR, San Diego, C...
PubChem Bioassay (2011)
BindingDB Entry DOI: 10.7270/Q25M647F
Apoptotic protease-activating factor 1
(Homo sapiens (Human))
BDBM50262667
(CHEMBL477139 | N-(6-methoxy-8H-indeno[1,2-d]thiazo...)
Show SMILES COc1ccc-2c(Cc3sc(NC(=O)c4cccs4)nc-23)c1
Show InChI InChI=1S/C16H12N2O2S2/c1-20-10-4-5-11-9(7-10)8-13-14(11)17-16(22-13)18-15(19)12-3-2-6-21-12/h2-7H,8H2,1H3,(H,17,18,19)
Reactome pathway
PCBioAssay
n/an/a 2.87E+4n/an/an/an/an/an/a
Burnham Center for Chemical Genomics
Curated by PubChem BioAssay
Assay Description
Data Source: Sanford-Burnham Center for Chemical Genomics (SBCCG) Source Affiliation: Sanford-Burnham Medical Research Institute (SBIMR, San Diego, C...
PubChem Bioassay (2011)
BindingDB Entry DOI: 10.7270/Q2JS9NZB
Apoptotic protease-activating factor 1
(Homo sapiens (Human))
BDBM50262667
(CHEMBL477139 | N-(6-methoxy-8H-indeno[1,2-d]thiazo...)
Show SMILES COc1ccc-2c(Cc3sc(NC(=O)c4cccs4)nc-23)c1
Show InChI InChI=1S/C16H12N2O2S2/c1-20-10-4-5-11-9(7-10)8-13-14(11)17-16(22-13)18-15(19)12-3-2-6-21-12/h2-7H,8H2,1H3,(H,17,18,19)
Reactome pathway
PCBioAssay
n/an/a>1.00E+5n/an/an/an/an/an/a
Burnham Center for Chemical Genomics
Curated by PubChem BioAssay
Assay Description
Data Source: Sanford-Burnham Center for Chemical Genomics (SBCCG) Source Affiliation: Sanford-Burnham Medical Research Institute (SBIMR, San Diego, C...
PubChem Bioassay (2011)
BindingDB Entry DOI: 10.7270/Q2F18X8S