BDBM50262715 CHEMBL518430::N-(5-(3-chlorobenzyl)thiazol-2-yl)thiophene-2-carboxamide::cid_1113641
SMILES: Clc1cccc(Cc2cnc(NC(=O)c3cccs3)s2)c1
InChI Key: InChIKey=QBTVHTFUCQFARG-UHFFFAOYSA-N
Data: 1 KI  1 EC50
Activity Spreadsheet -- Enzyme Inhibition Constant Data from BindingDB
Found 2 hits for monomerid = 50262715
Trg + Lig
Ki
nM
ΔG°
kcal/mole
IC50
nM
Kd
nM
EC50/IC50
nM
koff
s-1
kon
M-1s-1
pHTemp
°C
Tyrosine-protein kinase ABL1
(Homo sapiens (Human))
BDBM50262715
(CHEMBL518430 | N-(5-(3-chlorobenzyl)thiazol-2-yl)t...)
Show SMILES Clc1cccc(Cc2cnc(NC(=O)c3cccs3)s2)c1
Show InChI InChI=1S/C15H11ClN2OS2/c16-11-4-1-3-10(7-11)8-12-9-17-15(21-12)18-14(19)13-5-2-6-20-13/h1-7,9H,8H2,(H,17,18,19)
Reactome pathway
97n/an/an/an/an/an/an/an/a
Università degli Studi di Siena
Curated by ChEMBL
Assay Description
Inhibition of Abl kinase (unknown origin) by cell free assay
Bioorg Med Chem Lett 18: 4328-31 (2008)
Article DOI: 10.1016/j.bmcl.2008.06.082
BindingDB Entry DOI: 10.7270/Q2M908GW
streptokinase A precursor
(Streptococcus pyogenes M1 GAS)
BDBM50262715
(CHEMBL518430 | N-(5-(3-chlorobenzyl)thiazol-2-yl)t...)
Show SMILES Clc1cccc(Cc2cnc(NC(=O)c3cccs3)s2)c1
Show InChI InChI=1S/C15H11ClN2OS2/c16-11-4-1-3-10(7-11)8-12-9-17-15(21-12)18-14(19)13-5-2-6-20-13/h1-7,9H,8H2,(H,17,18,19)
PCBioAssay
n/an/an/an/a 1.50E+5n/an/an/an/a
Broad Institute
Curated by PubChem BioAssay
Assay Description
Keywords: Group A streptococcus, GAS, streptokinase, expression, virulence, inhibition, dose response, EC50 Assay Overview: The goal of this assa...
PubChem Bioassay (2009)
BindingDB Entry DOI: 10.7270/Q2736PBV