BDBM50262819 2'-Methyl-5'-(3-methyl-butyrylamino)-biphenyl-4-carboxylic acid cyclopropylmethyl-amide::CHEMBL479257
SMILES: CC(C)CC(=O)Nc1ccc(C)c(c1)-c1ccc(cc1)C(=O)NCC1CC1
InChI Key: InChIKey=DADNBOCEQTUVCX-UHFFFAOYSA-N
Data: 1 KI  1 IC50
Activity Spreadsheet -- Enzyme Inhibition Constant Data from BindingDB
Found 2 hits for monomerid = 50262819
Trg + Lig
Ki
nM
ΔG°
kcal/mole
IC50
nM
Kd
nM
EC50/IC50
nM
koff
s-1
kon
M-1s-1
pHTemp
°C
Mitogen-activated protein kinase 14
(Homo sapiens (Human))
BDBM50262819
(2'-Methyl-5'-(3-methyl-butyrylamino)-biphenyl-4-ca...)
Show SMILES CC(C)CC(=O)Nc1ccc(C)c(c1)-c1ccc(cc1)C(=O)NCC1CC1
Show InChI InChI=1S/C23H28N2O2/c1-15(2)12-22(26)25-20-11-4-16(3)21(13-20)18-7-9-19(10-8-18)23(27)24-14-17-5-6-17/h4,7-11,13,15,17H,5-6,12,14H2,1-3H3,(H,24,27)(H,25,26)
NCI pathway
Reactome pathway
330n/an/an/an/an/an/an/an/a
GlaxoSmithKline R&D
Curated by ChEMBL
Assay Description
Displacement of rhodamine-green labelled (2-(6-amino-3-imino-3H-xanthen-9-yl)-5-{[({4-[4-(4-Cl-3-hydroxyphenyl)-5-(4-pyridinyl)-1H-imidazol-2yl]pheny...
Bioorg Med Chem Lett 18: 4428-32 (2008)
Article DOI: 10.1016/j.bmcl.2008.06.048
BindingDB Entry DOI: 10.7270/Q2CR5T5P
Mitogen-activated protein kinase 14
(Homo sapiens (Human))
BDBM50262819
(2'-Methyl-5'-(3-methyl-butyrylamino)-biphenyl-4-ca...)
Show SMILES CC(C)CC(=O)Nc1ccc(C)c(c1)-c1ccc(cc1)C(=O)NCC1CC1
Show InChI InChI=1S/C23H28N2O2/c1-15(2)12-22(26)25-20-11-4-16(3)21(13-20)18-7-9-19(10-8-18)23(27)24-14-17-5-6-17/h4,7-11,13,15,17H,5-6,12,14H2,1-3H3,(H,24,27)(H,25,26)
NCI pathway
Reactome pathway
n/an/a 2.10E+3n/an/an/an/an/an/a
GlaxoSmithKline R&D
Curated by ChEMBL
Assay Description
Displacement of rhodamine-green labelled (2-(6-amino-3-imino-3H-xanthen-9-yl)-5-{[({4-[4-(4-Cl-3-hydroxyphenyl)-5-(4-pyridinyl)-1H-imidazol-2yl]pheny...
Bioorg Med Chem Lett 18: 4428-32 (2008)
Article DOI: 10.1016/j.bmcl.2008.06.048
BindingDB Entry DOI: 10.7270/Q2CR5T5P