null
SMILES: COc1ccc2nc(C)n(-c3ccc(OCCCN4CCCC4)cc3)c(=O)c2c1
InChI Key: InChIKey=ZEYAXGNLTQYPRW-UHFFFAOYSA-N
Activity Spreadsheet -- Enzyme Inhibition Constant Data from BindingDB
Found 4 hits for monomerid = 50262838
Trg + Lig
Ki
nM
ΔG°
kcal/mole
IC50
nM
Kd
nM
EC50/IC50
nM
koff
s-1
kon
M-1s-1
pHTemp
°C
Histamine H3 receptor
(Homo sapiens (Human))
BDBM50262838
(6-Methoxy-2-methyl-3-(4-{[3-(1-pyrrolidinyl)propyl...)
Show SMILES COc1ccc2nc(C)n(-c3ccc(OCCCN4CCCC4)cc3)c(=O)c2c1
Show InChI InChI=1S/C23H27N3O3/c1-17-24-22-11-10-20(28-2)16-21(22)23(27)26(17)18-6-8-19(9-7-18)29-15-5-14-25-12-3-4-13-25/h6-11,16H,3-5,12-15H2,1-2H3
Reactome pathway
0.313n/an/an/an/an/an/an/an/a
Bioprojet-Biotech
Curated by ChEMBL
Assay Description
Displacement of [125I]Iodoproxyfan from human recombinant histamine H3 receptor by Competitive binding assay
Bioorg Med Chem Lett 21: 5378-83 (2011)
Article DOI: 10.1016/j.bmcl.2011.07.006
BindingDB Entry DOI: 10.7270/Q2VX0GXK
Potassium voltage-gated channel subfamily H member 2
(Homo sapiens (Human))
BDBM50262838
(6-Methoxy-2-methyl-3-(4-{[3-(1-pyrrolidinyl)propyl...)
Show SMILES COc1ccc2nc(C)n(-c3ccc(OCCCN4CCCC4)cc3)c(=O)c2c1
Show InChI InChI=1S/C23H27N3O3/c1-17-24-22-11-10-20(28-2)16-21(22)23(27)26(17)18-6-8-19(9-7-18)29-15-5-14-25-12-3-4-13-25/h6-11,16H,3-5,12-15H2,1-2H3
Reactome pathway
n/an/a 1.00E+4n/an/an/an/an/an/a
Bioprojet-Biotech
Curated by ChEMBL
Assay Description
Displacement of [3H]dofetilide from human recombinant ERG by Competitive binding assay
Bioorg Med Chem Lett 21: 5378-83 (2011)
Article DOI: 10.1016/j.bmcl.2011.07.006
BindingDB Entry DOI: 10.7270/Q2VX0GXK
Histamine H3 receptor
(Homo sapiens (Human))
BDBM50262838
(6-Methoxy-2-methyl-3-(4-{[3-(1-pyrrolidinyl)propyl...)
Show SMILES COc1ccc2nc(C)n(-c3ccc(OCCCN4CCCC4)cc3)c(=O)c2c1
Show InChI InChI=1S/C23H27N3O3/c1-17-24-22-11-10-20(28-2)16-21(22)23(27)26(17)18-6-8-19(9-7-18)29-15-5-14-25-12-3-4-13-25/h6-11,16H,3-5,12-15H2,1-2H3
Reactome pathway
n/an/a 1.10n/an/an/an/an/an/a
Tsukuba Research Institute
Curated by ChEMBL
Assay Description
Displacement of [3H]N-alpha-methylhistamine from human histamine H3 receptor expressed in CHO-K1 cells
J Med Chem 51: 4780-9 (2008)
Article DOI: 10.1021/jm8003834
BindingDB Entry DOI: 10.7270/Q2FQ9WFW
Potassium voltage-gated channel subfamily H member 2
(Homo sapiens (Human))
BDBM50262838
(6-Methoxy-2-methyl-3-(4-{[3-(1-pyrrolidinyl)propyl...)
Show SMILES COc1ccc2nc(C)n(-c3ccc(OCCCN4CCCC4)cc3)c(=O)c2c1
Show InChI InChI=1S/C23H27N3O3/c1-17-24-22-11-10-20(28-2)16-21(22)23(27)26(17)18-6-8-19(9-7-18)29-15-5-14-25-12-3-4-13-25/h6-11,16H,3-5,12-15H2,1-2H3
Reactome pathway
n/an/a>1.00E+4n/an/an/an/an/an/a
Tsukuba Research Institute
Curated by ChEMBL
Assay Description
Displacement of [35S]N-[(4R)-1'-[(2R)-6-cyano-1,2,3,4-tetrahydro-2-naphthalenyl]-3,4-dihydro-4-hydroxyspiro[2H-1-benzopyran-2,4'-piperidin]-6-yl]meth...
J Med Chem 51: 4780-9 (2008)
Article DOI: 10.1021/jm8003834
BindingDB Entry DOI: 10.7270/Q2FQ9WFW