null
SMILES: Cc1ccc(NC(=O)c2ccco2)cc1-c1ccc(cc1)C(=O)NCC1CC1
InChI Key: InChIKey=BKWXTFBEQWOLSP-UHFFFAOYSA-N
Activity Spreadsheet -- Enzyme Inhibition Constant Data from BindingDB
Found 2 hits for monomerid = 50262864
Trg + Lig
Ki
nM
ΔG°
kcal/mole
IC50
nM
Kd
nM
EC50/IC50
nM
koff
s-1
kon
M-1s-1
pHTemp
°C
Mitogen-activated protein kinase 14
(Homo sapiens (Human))
BDBM50262864
(CHEMBL477582 | Furan-2-carboxylic acid [4'-(cyclop...)
Show SMILES Cc1ccc(NC(=O)c2ccco2)cc1-c1ccc(cc1)C(=O)NCC1CC1
Show InChI InChI=1S/C23H22N2O3/c1-15-4-11-19(25-23(27)21-3-2-12-28-21)13-20(15)17-7-9-18(10-8-17)22(26)24-14-16-5-6-16/h2-4,7-13,16H,5-6,14H2,1H3,(H,24,26)(H,25,27)
NCI pathway
Reactome pathway
25n/an/an/an/an/an/an/an/a
GlaxoSmithKline R&D
Curated by ChEMBL
Assay Description
Displacement of rhodamine-green labelled (2-(6-amino-3-imino-3H-xanthen-9-yl)-5-{[({4-[4-(4-Cl-3-hydroxyphenyl)-5-(4-pyridinyl)-1H-imidazol-2yl]pheny...
Bioorg Med Chem Lett 18: 4428-32 (2008)
Article DOI: 10.1016/j.bmcl.2008.06.048
BindingDB Entry DOI: 10.7270/Q2CR5T5P
Mitogen-activated protein kinase 14
(Homo sapiens (Human))
BDBM50262864
(CHEMBL477582 | Furan-2-carboxylic acid [4'-(cyclop...)
Show SMILES Cc1ccc(NC(=O)c2ccco2)cc1-c1ccc(cc1)C(=O)NCC1CC1
Show InChI InChI=1S/C23H22N2O3/c1-15-4-11-19(25-23(27)21-3-2-12-28-21)13-20(15)17-7-9-18(10-8-17)22(26)24-14-16-5-6-16/h2-4,7-13,16H,5-6,14H2,1H3,(H,24,26)(H,25,27)
NCI pathway
Reactome pathway
n/an/a 160n/an/an/an/an/an/a
GlaxoSmithKline R&D
Curated by ChEMBL
Assay Description
Displacement of rhodamine-green labelled (2-(6-amino-3-imino-3H-xanthen-9-yl)-5-{[({4-[4-(4-Cl-3-hydroxyphenyl)-5-(4-pyridinyl)-1H-imidazol-2yl]pheny...
Bioorg Med Chem Lett 18: 4428-32 (2008)
Article DOI: 10.1016/j.bmcl.2008.06.048
BindingDB Entry DOI: 10.7270/Q2CR5T5P