BDBM50262912 (1-(3-ethylphenyl)-2-p-tolyl-1H-imidazol-4-yl)(4-(naphthalen-2-yl)piperazin-1-yl)methanone::CHEMBL476747
SMILES: CCc1cccc(c1)-n1cc(nc1-c1ccc(C)cc1)C(=O)N1CCN(CC1)c1ccc2ccccc2c1
InChI Key: InChIKey=LUPBYWQGCMEXAL-UHFFFAOYSA-N
Data: 1 IC50  1 EC50
Activity Spreadsheet -- Enzyme Inhibition Constant Data from BindingDB
Found 2 hits for monomerid = 50262912
Trg + Lig
Ki
nM
ΔG°
kcal/mole
IC50
nM
Kd
nM
EC50/IC50
nM
koff
s-1
kon
M-1s-1
pHTemp
°C
Cholecystokinin receptor
(Homo sapiens (Human))
BDBM50262912
((1-(3-ethylphenyl)-2-p-tolyl-1H-imidazol-4-yl)(4-(...)
Show SMILES CCc1cccc(c1)-n1cc(nc1-c1ccc(C)cc1)C(=O)N1CCN(CC1)c1ccc2ccccc2c1
Show InChI InChI=1S/C33H32N4O/c1-3-25-7-6-10-30(21-25)37-23-31(34-32(37)27-13-11-24(2)12-14-27)33(38)36-19-17-35(18-20-36)29-16-15-26-8-4-5-9-28(26)22-29/h4-16,21-23H,3,17-20H2,1-2H3
Reactome pathway
n/an/a 43n/an/an/an/an/an/a
Merck Research Laboratories
Curated by ChEMBL
Assay Description
Inhibition of human CCK1 receptor
Bioorg Med Chem Lett 18: 4393-6 (2008)
Article DOI: 10.1016/j.bmcl.2008.06.057
BindingDB Entry DOI: 10.7270/Q2HH6JW0
Cholecystokinin receptor
(Homo sapiens (Human))
BDBM50262912
((1-(3-ethylphenyl)-2-p-tolyl-1H-imidazol-4-yl)(4-(...)
Show SMILES CCc1cccc(c1)-n1cc(nc1-c1ccc(C)cc1)C(=O)N1CCN(CC1)c1ccc2ccccc2c1
Show InChI InChI=1S/C33H32N4O/c1-3-25-7-6-10-30(21-25)37-23-31(34-32(37)27-13-11-24(2)12-14-27)33(38)36-19-17-35(18-20-36)29-16-15-26-8-4-5-9-28(26)22-29/h4-16,21-23H,3,17-20H2,1-2H3
Reactome pathway
n/an/an/an/a 65n/an/an/an/a
Merck Research Laboratories
Curated by ChEMBL
Assay Description
Agonist activity against human CCK1 receptor
Bioorg Med Chem Lett 18: 4393-6 (2008)
Article DOI: 10.1016/j.bmcl.2008.06.057
BindingDB Entry DOI: 10.7270/Q2HH6JW0