BDBM50262932 CHEMBL478415::[2-Methyl-5-(4-methylsulphonyl)phenyl-3-(2-methoxyethyl)-1-(4-trifluoromethyl)phenyl]-1Hpyrrole
SMILES: COCCc1cc(-c2ccc(cc2)S(C)(=O)=O)n(c1C)-c1ccc(cc1)C(F)(F)F
InChI Key: InChIKey=UBIIPLVJLRUEQK-UHFFFAOYSA-N
Data: 2 IC50
Activity Spreadsheet -- Enzyme Inhibition Constant Data from BindingDB
Found 2 hits for monomerid = 50262932
Trg + Lig
Ki
nM
ΔG°
kcal/mole
IC50
nM
Kd
nM
EC50/IC50
nM
koff
s-1
kon
M-1s-1
pHTemp
°C
Cyclooxygenase-2 (COX-2)
(Mus musculus (Mouse))
BDBM50262932
(CHEMBL478415 | [2-Methyl-5-(4-methylsulphonyl)phen...)
Show SMILES COCCc1cc(-c2ccc(cc2)S(C)(=O)=O)n(c1C)-c1ccc(cc1)C(F)(F)F
Show InChI InChI=1S/C22H22F3NO3S/c1-15-17(12-13-29-2)14-21(16-4-10-20(11-5-16)30(3,27)28)26(15)19-8-6-18(7-9-19)22(23,24)25/h4-11,14H,12-13H2,1-3H3
n/an/a 49n/an/an/an/an/an/a
Universita di Siena
Curated by ChEMBL
Assay Description
Inhibition of mouse COX2 in LPS-stimulated mouse J774 cells assessed as PGE2 production by radioimmunoassay
J Med Chem 51: 4476-81 (2008)
Article DOI: 10.1021/jm800084s
BindingDB Entry DOI: 10.7270/Q2KH0N55
Prostaglandin G/H synthase (cyclooxygenase)
(Mus musculus)
BDBM50262932
(CHEMBL478415 | [2-Methyl-5-(4-methylsulphonyl)phen...)
Show SMILES COCCc1cc(-c2ccc(cc2)S(C)(=O)=O)n(c1C)-c1ccc(cc1)C(F)(F)F
Show InChI InChI=1S/C22H22F3NO3S/c1-15-17(12-13-29-2)14-21(16-4-10-20(11-5-16)30(3,27)28)26(15)19-8-6-18(7-9-19)22(23,24)25/h4-11,14H,12-13H2,1-3H3
Reactome pathway
n/an/a>1.00E+5n/an/an/an/an/an/a
Universita di Siena
Curated by ChEMBL
Assay Description
Inhibition of mouse COX1 in mouse J774 cells assessed as PGE2 production by radioimmunoassay
J Med Chem 51: 4476-81 (2008)
Article DOI: 10.1021/jm800084s
BindingDB Entry DOI: 10.7270/Q2KH0N55