BDBM50262969 (4-(naphthalen-2-yl)piperazin-1-yl)(1-(3-propoxyphenyl)-2-p-tolyl-1H-imidazol-4-yl)methanone::CHEMBL479030
SMILES: CCCOc1cccc(c1)-n1cc(nc1-c1ccc(C)cc1)C(=O)N1CCN(CC1)c1ccc2ccccc2c1
InChI Key: InChIKey=RSZANKIEASGTQA-UHFFFAOYSA-N
Data: 1 IC50  1 EC50
Activity Spreadsheet -- Enzyme Inhibition Constant Data from BindingDB
Found 2 hits for monomerid = 50262969
Trg + Lig
Ki
nM
ΔG°
kcal/mole
IC50
nM
Kd
nM
EC50/IC50
nM
koff
s-1
kon
M-1s-1
pHTemp
°C
Cholecystokinin receptor
(Homo sapiens (Human))
BDBM50262969
((4-(naphthalen-2-yl)piperazin-1-yl)(1-(3-propoxyph...)
Show SMILES CCCOc1cccc(c1)-n1cc(nc1-c1ccc(C)cc1)C(=O)N1CCN(CC1)c1ccc2ccccc2c1
Show InChI InChI=1S/C34H34N4O2/c1-3-21-40-31-10-6-9-30(23-31)38-24-32(35-33(38)27-13-11-25(2)12-14-27)34(39)37-19-17-36(18-20-37)29-16-15-26-7-4-5-8-28(26)22-29/h4-16,22-24H,3,17-21H2,1-2H3
Reactome pathway
n/an/a 160n/an/an/an/an/an/a
Merck Research Laboratories
Curated by ChEMBL
Assay Description
Inhibition of human CCK1 receptor
Bioorg Med Chem Lett 18: 4393-6 (2008)
Article DOI: 10.1016/j.bmcl.2008.06.057
BindingDB Entry DOI: 10.7270/Q2HH6JW0
Cholecystokinin receptor
(Homo sapiens (Human))
BDBM50262969
((4-(naphthalen-2-yl)piperazin-1-yl)(1-(3-propoxyph...)
Show SMILES CCCOc1cccc(c1)-n1cc(nc1-c1ccc(C)cc1)C(=O)N1CCN(CC1)c1ccc2ccccc2c1
Show InChI InChI=1S/C34H34N4O2/c1-3-21-40-31-10-6-9-30(23-31)38-24-32(35-33(38)27-13-11-25(2)12-14-27)34(39)37-19-17-36(18-20-37)29-16-15-26-7-4-5-8-28(26)22-29/h4-16,22-24H,3,17-21H2,1-2H3
Reactome pathway
n/an/an/an/a 962n/an/an/an/a
Merck Research Laboratories
Curated by ChEMBL
Assay Description
Agonist activity against human CCK1 receptor
Bioorg Med Chem Lett 18: 4393-6 (2008)
Article DOI: 10.1016/j.bmcl.2008.06.057
BindingDB Entry DOI: 10.7270/Q2HH6JW0