BDBM50262971 (4-(naphthalen-2-yl)piperazin-1-yl)(2-p-tolyl-1-(3-(trifluoromethoxy)phenyl)-1H-imidazol-4-yl)methanone::CHEMBL504024
SMILES: Cc1ccc(cc1)-c1nc(cn1-c1cccc(OC(F)(F)F)c1)C(=O)N1CCN(CC1)c1ccc2ccccc2c1
InChI Key: InChIKey=NTKWSQGHJODGQP-UHFFFAOYSA-N
Data: 1 IC50  1 EC50
Activity Spreadsheet -- Enzyme Inhibition Constant Data from BindingDB
Found 2 hits for monomerid = 50262971
Trg + Lig
Ki
nM
ΔG°
kcal/mole
IC50
nM
Kd
nM
EC50/IC50
nM
koff
s-1
kon
M-1s-1
pHTemp
°C
Cholecystokinin receptor
(Homo sapiens (Human))
BDBM50262971
((4-(naphthalen-2-yl)piperazin-1-yl)(2-p-tolyl-1-(3...)
Show SMILES Cc1ccc(cc1)-c1nc(cn1-c1cccc(OC(F)(F)F)c1)C(=O)N1CCN(CC1)c1ccc2ccccc2c1
Show InChI InChI=1S/C32H27F3N4O2/c1-22-9-11-24(12-10-22)30-36-29(21-39(30)27-7-4-8-28(20-27)41-32(33,34)35)31(40)38-17-15-37(16-18-38)26-14-13-23-5-2-3-6-25(23)19-26/h2-14,19-21H,15-18H2,1H3
Reactome pathway
n/an/a 130n/an/an/an/an/an/a
Merck Research Laboratories
Curated by ChEMBL
Assay Description
Inhibition of human CCK1 receptor
Bioorg Med Chem Lett 18: 4393-6 (2008)
Article DOI: 10.1016/j.bmcl.2008.06.057
BindingDB Entry DOI: 10.7270/Q2HH6JW0
Cholecystokinin receptor
(Homo sapiens (Human))
BDBM50262971
((4-(naphthalen-2-yl)piperazin-1-yl)(2-p-tolyl-1-(3...)
Show SMILES Cc1ccc(cc1)-c1nc(cn1-c1cccc(OC(F)(F)F)c1)C(=O)N1CCN(CC1)c1ccc2ccccc2c1
Show InChI InChI=1S/C32H27F3N4O2/c1-22-9-11-24(12-10-22)30-36-29(21-39(30)27-7-4-8-28(20-27)41-32(33,34)35)31(40)38-17-15-37(16-18-38)26-14-13-23-5-2-3-6-25(23)19-26/h2-14,19-21H,15-18H2,1H3
Reactome pathway
n/an/an/an/a 3.15E+3n/an/an/an/a
Merck Research Laboratories
Curated by ChEMBL
Assay Description
Agonist activity against human CCK1 receptor
Bioorg Med Chem Lett 18: 4393-6 (2008)
Article DOI: 10.1016/j.bmcl.2008.06.057
BindingDB Entry DOI: 10.7270/Q2HH6JW0