BDBM50263061 (1-(3-ethoxyphenyl)-2-(4-fluorophenyl)-1H-imidazol-4-yl)(4-(naphthalen-2-yl)piperazin-1-yl)methanone::CHEMBL476530
SMILES: CCOc1cccc(c1)-n1cc(nc1-c1ccc(F)cc1)C(=O)N1CCN(CC1)c1ccc2ccccc2c1
InChI Key: InChIKey=DLBAZKJDFGSWLT-UHFFFAOYSA-N
Data: 1 IC50  1 EC50
Activity Spreadsheet -- Enzyme Inhibition Constant Data from BindingDB
Found 2 hits for monomerid = 50263061
Trg + Lig
Ki
nM
ΔG°
kcal/mole
IC50
nM
Kd
nM
EC50/IC50
nM
koff
s-1
kon
M-1s-1
pHTemp
°C
Cholecystokinin receptor
(Homo sapiens (Human))
BDBM50263061
((1-(3-ethoxyphenyl)-2-(4-fluorophenyl)-1H-imidazol...)
Show SMILES CCOc1cccc(c1)-n1cc(nc1-c1ccc(F)cc1)C(=O)N1CCN(CC1)c1ccc2ccccc2c1
Show InChI InChI=1S/C32H29FN4O2/c1-2-39-29-9-5-8-28(21-29)37-22-30(34-31(37)24-10-13-26(33)14-11-24)32(38)36-18-16-35(17-19-36)27-15-12-23-6-3-4-7-25(23)20-27/h3-15,20-22H,2,16-19H2,1H3
Reactome pathway
n/an/a 1.90n/an/an/an/an/an/a
Merck Research Laboratories
Curated by ChEMBL
Assay Description
Inhibition of human CCK1 receptor
Bioorg Med Chem Lett 18: 4393-6 (2008)
Article DOI: 10.1016/j.bmcl.2008.06.057
BindingDB Entry DOI: 10.7270/Q2HH6JW0
Cholecystokinin receptor
(Homo sapiens (Human))
BDBM50263061
((1-(3-ethoxyphenyl)-2-(4-fluorophenyl)-1H-imidazol...)
Show SMILES CCOc1cccc(c1)-n1cc(nc1-c1ccc(F)cc1)C(=O)N1CCN(CC1)c1ccc2ccccc2c1
Show InChI InChI=1S/C32H29FN4O2/c1-2-39-29-9-5-8-28(21-29)37-22-30(34-31(37)24-10-13-26(33)14-11-24)32(38)36-18-16-35(17-19-36)27-15-12-23-6-3-4-7-25(23)20-27/h3-15,20-22H,2,16-19H2,1H3
Reactome pathway
n/an/an/an/a 2.90n/an/an/an/a
Merck Research Laboratories
Curated by ChEMBL
Assay Description
Agonist activity against human CCK1 receptor
Bioorg Med Chem Lett 18: 4393-6 (2008)
Article DOI: 10.1016/j.bmcl.2008.06.057
BindingDB Entry DOI: 10.7270/Q2HH6JW0