BDBM50263071 (2S)-2-hydroxy-1-(4-(4-(4-(1-isopropyl-2-methyl-1H-imidazol-5-yl)pyrimidin-2-ylamino)phenyl)piperazin-1-yl)propan-1-one::CHEMBL515311
SMILES: CC(C)n1c(C)ncc1-c1ccnc(Nc2ccc(cc2)N2CCN(CC2)C(=O)[C@H](C)O)n1
InChI Key: InChIKey=WCWLSNGOKLMMBH-KRWDZBQOSA-N
Data: 2 IC50
Activity Spreadsheet -- Enzyme Inhibition Constant Data from BindingDB
Found 2 hits for monomerid = 50263071
Trg + Lig
Ki
nM
ΔG°
kcal/mole
IC50
nM
Kd
nM
EC50/IC50
nM
koff
s-1
kon
M-1s-1
pHTemp
°C
Potassium voltage-gated channel subfamily H member 2
(Homo sapiens (Human))
BDBM50263071
((2S)-2-hydroxy-1-(4-(4-(4-(1-isopropyl-2-methyl-1H...)
Show SMILES CC(C)n1c(C)ncc1-c1ccnc(Nc2ccc(cc2)N2CCN(CC2)C(=O)[C@H](C)O)n1 |r|
Show InChI InChI=1S/C24H31N7O2/c1-16(2)31-18(4)26-15-22(31)21-9-10-25-24(28-21)27-19-5-7-20(8-6-19)29-11-13-30(14-12-29)23(33)17(3)32/h5-10,15-17,32H,11-14H2,1-4H3,(H,25,27,28)/t17-/m0/s1
Reactome pathway
n/an/a>2.40E+4n/an/an/an/an/an/a
AstraZeneca Pharmaceuticals
Curated by ChEMBL
Assay Description
Inhibition of human ERG
Bioorg Med Chem Lett 18: 4442-6 (2008)
Article DOI: 10.1016/j.bmcl.2008.06.027
BindingDB Entry DOI: 10.7270/Q24749PG
Cyclin-dependent kinase 2
(Homo sapiens (Human))
BDBM50263071
((2S)-2-hydroxy-1-(4-(4-(4-(1-isopropyl-2-methyl-1H...)
Show SMILES CC(C)n1c(C)ncc1-c1ccnc(Nc2ccc(cc2)N2CCN(CC2)C(=O)[C@H](C)O)n1 |r|
Show InChI InChI=1S/C24H31N7O2/c1-16(2)31-18(4)26-15-22(31)21-9-10-25-24(28-21)27-19-5-7-20(8-6-19)29-11-13-30(14-12-29)23(33)17(3)32/h5-10,15-17,32H,11-14H2,1-4H3,(H,25,27,28)/t17-/m0/s1
NCI pathway
Reactome pathway
n/an/a 17n/an/an/an/an/an/a
AstraZeneca Pharmaceuticals
Curated by ChEMBL
Assay Description
Inhibition of CDK2/Cyclin E (unknown origin)
Bioorg Med Chem Lett 18: 4442-6 (2008)
Article DOI: 10.1016/j.bmcl.2008.06.027
BindingDB Entry DOI: 10.7270/Q24749PG