BDBM50263113 4-(1-isopropyl-2-methyl-1H-imidazol-5-yl)-N-(4-morpholinophenyl)pyrimidin-2-amine::CHEMBL514690
SMILES: CC(C)n1c(C)ncc1-c1ccnc(Nc2ccc(cc2)N2CCOCC2)n1
InChI Key: InChIKey=DFCUTNCAGIEUFG-UHFFFAOYSA-N
Data: 1 IC50
Activity Spreadsheet -- Enzyme Inhibition Constant Data from BindingDB
Found 1 hit for monomerid = 50263113
Trg + Lig
Ki
nM
ΔG°
kcal/mole
IC50
nM
Kd
nM
EC50/IC50
nM
koff
s-1
kon
M-1s-1
pHTemp
°C
Cyclin-dependent kinase 2
(Homo sapiens (Human))
BDBM50263113
(4-(1-isopropyl-2-methyl-1H-imidazol-5-yl)-N-(4-mor...)
Show SMILES CC(C)n1c(C)ncc1-c1ccnc(Nc2ccc(cc2)N2CCOCC2)n1
Show InChI InChI=1S/C21H26N6O/c1-15(2)27-16(3)23-14-20(27)19-8-9-22-21(25-19)24-17-4-6-18(7-5-17)26-10-12-28-13-11-26/h4-9,14-15H,10-13H2,1-3H3,(H,22,24,25)
NCI pathway
Reactome pathway
n/an/a 9n/an/an/an/an/an/a
AstraZeneca Pharmaceuticals
Curated by ChEMBL
Assay Description
Inhibition of CDK2/Cyclin E (unknown origin)
Bioorg Med Chem Lett 18: 4442-6 (2008)
Article DOI: 10.1016/j.bmcl.2008.06.027
BindingDB Entry DOI: 10.7270/Q24749PG