BDBM50263175 4-(4-methyl-1H-indol-5-ylamino)-2-(3-oxo-3-(piperidin-1-yl)prop-1-enyl)thieno[2,3-b]pyridine-5-carbonitrile::CHEMBL476149
SMILES: Cc1c(Nc2c(cnc3sc(\C=C\C(=O)N4CCCCC4)cc23)C#N)ccc2[nH]ccc12
InChI Key: InChIKey=RQFQHXQYIYDKMC-VMPITWQZSA-N
Data: 2 IC50
Activity Spreadsheet -- Enzyme Inhibition Constant Data from BindingDB
Found 2 hits for monomerid = 50263175
Trg + Lig
Ki
nM
ΔG°
kcal/mole
IC50
nM
Kd
nM
EC50/IC50
nM
koff
s-1
kon
M-1s-1
pHTemp
°C
Protein kinase C theta type
(Homo sapiens (Human))
BDBM50263175
(4-(4-methyl-1H-indol-5-ylamino)-2-(3-oxo-3-(piperi...)
Show SMILES Cc1c(Nc2c(cnc3sc(\C=C\C(=O)N4CCCCC4)cc23)C#N)ccc2[nH]ccc12
Show InChI InChI=1S/C25H23N5OS/c1-16-19-9-10-27-22(19)7-6-21(16)29-24-17(14-26)15-28-25-20(24)13-18(32-25)5-8-23(31)30-11-3-2-4-12-30/h5-10,13,15,27H,2-4,11-12H2,1H3,(H,28,29)/b8-5+
NCI pathway
Reactome pathway
n/an/a 48n/an/an/an/an/an/a
Wyeth Research
Curated by ChEMBL
Assay Description
Inhibition of PKCtheta
Bioorg Med Chem Lett 18: 4420-3 (2008)
Article DOI: 10.1016/j.bmcl.2008.06.040
BindingDB Entry DOI: 10.7270/Q2WS8T2G
Protein kinase C delta type
(Homo sapiens (Human))
BDBM50263175
(4-(4-methyl-1H-indol-5-ylamino)-2-(3-oxo-3-(piperi...)
Show SMILES Cc1c(Nc2c(cnc3sc(\C=C\C(=O)N4CCCCC4)cc23)C#N)ccc2[nH]ccc12
Show InChI InChI=1S/C25H23N5OS/c1-16-19-9-10-27-22(19)7-6-21(16)29-24-17(14-26)15-28-25-20(24)13-18(32-25)5-8-23(31)30-11-3-2-4-12-30/h5-10,13,15,27H,2-4,11-12H2,1H3,(H,28,29)/b8-5+
NCI pathway
Reactome pathway
n/an/a 450n/an/an/an/an/an/a
Wyeth Research
Curated by ChEMBL
Assay Description
Inhibition of PKCdelta
Bioorg Med Chem Lett 18: 4420-3 (2008)
Article DOI: 10.1016/j.bmcl.2008.06.040
BindingDB Entry DOI: 10.7270/Q2WS8T2G