BDBM50263345 3-(3-Bromo-phenyl)-5,7-diphenyl-pyrazolo[1,5-a]pyrimidine::CHEMBL476980
SMILES: Brc1cccc(c1)-c1cnn2c(cc(nc12)-c1ccccc1)-c1ccccc1
InChI Key: InChIKey=PUONRUDNJAWKNL-UHFFFAOYSA-N
Data: 1 IC50
Activity Spreadsheet -- Enzyme Inhibition Constant Data from BindingDB
Found 1 hit for monomerid = 50263345
Trg + Lig
Ki
nM
ΔG°
kcal/mole
IC50
nM
Kd
nM
EC50/IC50
nM
koff
s-1
kon
M-1s-1
pHTemp
°C
1-deoxy-D-xylulose-5-phosphate synthase
(Mycobacterium tuberculosis)
BDBM50263345
(3-(3-Bromo-phenyl)-5,7-diphenyl-pyrazolo[1,5-a]pyr...)
Show SMILES Brc1cccc(c1)-c1cnn2c(cc(nc12)-c1ccccc1)-c1ccccc1
Show InChI InChI=1S/C24H16BrN3/c25-20-13-7-12-19(14-20)21-16-26-28-23(18-10-5-2-6-11-18)15-22(27-24(21)28)17-8-3-1-4-9-17/h1-16H
n/an/a>2.00E+5n/an/an/an/an/an/a
University of Illinois at Chicago
Curated by ChEMBL
Assay Description
Inhibition of Mycobacterium tuberculosis cloned 1-deoxy-D-xylulose-5-phosphate synthase expressed in Escherichia coli
Bioorg Med Chem Lett 18: 5320-3 (2008)
Article DOI: 10.1016/j.bmcl.2008.08.034
BindingDB Entry DOI: 10.7270/Q2TX3F71