BDBM50263548 (E)-3-(4-(3-aminophenylthio)-2,3-bis(trifluoromethyl)phenyl)-1-morpholinoprop-2-en-1-one::3-({4-[(1E)-3-morpholin-4-yl-3-oxoprop-1-en-1-yl]-2,3-bis(trifluoromethyl)phenyl}sulfanyl)aniline::CHEMBL478464
SMILES: Nc1cccc(Sc2ccc(\C=C\C(=O)N3CCOCC3)c(c2C(F)(F)F)C(F)(F)F)c1
InChI Key: InChIKey=KLSZVPNVFKKIRD-FNORWQNLSA-N
Data: 1 IC50
PDB links: 1 PDB ID matches this monomer.
Activity Spreadsheet -- Enzyme Inhibition Constant Data from BindingDB
Found 1 hit for monomerid = 50263548
Trg + Lig
Ki
nM
ΔG°
kcal/mole
IC50
nM
Kd
nM
EC50/IC50
nM
koff
s-1
kon
M-1s-1
pHTemp
°C
Integrin alpha-L/beta-2 (LFA-1)
(Homo sapiens (Human))
BDBM50263548
((E)-3-(4-(3-aminophenylthio)-2,3-bis(trifluorometh...)
Show SMILES Nc1cccc(Sc2ccc(\C=C\C(=O)N3CCOCC3)c(c2C(F)(F)F)C(F)(F)F)c1
Show InChI InChI=1S/C21H18F6N2O2S/c22-20(23,24)18-13(5-7-17(30)29-8-10-31-11-9-29)4-6-16(19(18)21(25,26)27)32-15-3-1-2-14(28)12-15/h1-7,12H,8-11,28H2/b7-5+
NCI pathway
Reactome pathway
n/an/a 1.70n/an/an/an/an/an/a
Biogen Idec Inc.
Curated by ChEMBL
Assay Description
Inhibition of recombinant LFA1/ICAM1-IG interaction (unknown origin) by time-resolved fluorimetry method
Bioorg Med Chem Lett 18: 5249-51 (2008)
Article DOI: 10.1016/j.bmcl.2008.08.061
BindingDB Entry DOI: 10.7270/Q2CV4HK0
3D
3D Structure (crystal)