BDBM50263611 2-cyano-N-methyl-4-(spiro[3.5]nonan-7-ylmethylamino)-6-(2,2,6,6-tetramethylpiperidin-4-yloxy)pyrimidine-5-carboxamide::CHEMBL478224
SMILES: CNC(=O)c1c(NCC2CCC3(CCC3)CC2)nc(nc1OC1CC(C)(C)NC(C)(C)C1)C#N
InChI Key: InChIKey=FDHGENAHJDLTJT-UHFFFAOYSA-N
Data: 3 IC50
Activity Spreadsheet -- Enzyme Inhibition Constant Data from BindingDB
Found 3 hits for monomerid = 50263611
Trg + Lig
Ki
nM
ΔG°
kcal/mole
IC50
nM
Kd
nM
EC50/IC50
nM
koff
s-1
kon
M-1s-1
pHTemp
°C
Potassium voltage-gated channel subfamily H member 2
(Homo sapiens (Human))
BDBM50263611
(2-cyano-N-methyl-4-(spiro[3.5]nonan-7-ylmethylamin...)
Show SMILES CNC(=O)c1c(NCC2CCC3(CCC3)CC2)nc(nc1OC1CC(C)(C)NC(C)(C)C1)C#N
Show InChI InChI=1S/C26H40N6O2/c1-24(2)13-18(14-25(3,4)32-24)34-23-20(22(33)28-5)21(30-19(15-27)31-23)29-16-17-7-11-26(12-8-17)9-6-10-26/h17-18,32H,6-14,16H2,1-5H3,(H,28,33)(H,29,30,31)
Reactome pathway
n/an/a 5.04E+3n/an/an/an/an/an/a
Novartis Institutes for BioMedical Research
Curated by ChEMBL
Assay Description
Displacement of [3H]dofetilide from human ERG in HEK293 cells
Bioorg Med Chem Lett 18: 5280-4 (2008)
Article DOI: 10.1016/j.bmcl.2008.08.067
BindingDB Entry DOI: 10.7270/Q2736QQ6
Cathepsin S
(Homo sapiens (Human))
BDBM50263611
(2-cyano-N-methyl-4-(spiro[3.5]nonan-7-ylmethylamin...)
Show SMILES CNC(=O)c1c(NCC2CCC3(CCC3)CC2)nc(nc1OC1CC(C)(C)NC(C)(C)C1)C#N
Show InChI InChI=1S/C26H40N6O2/c1-24(2)13-18(14-25(3,4)32-24)34-23-20(22(33)28-5)21(30-19(15-27)31-23)29-16-17-7-11-26(12-8-17)9-6-10-26/h17-18,32H,6-14,16H2,1-5H3,(H,28,33)(H,29,30,31)
Reactome pathway
n/an/a 5n/an/an/an/an/an/a
Novartis Institutes for BioMedical Research
Curated by ChEMBL
Assay Description
Inhibition of human recombinant cathepsin S by fluorometric assay
Bioorg Med Chem Lett 18: 5280-4 (2008)
Article DOI: 10.1016/j.bmcl.2008.08.067
BindingDB Entry DOI: 10.7270/Q2736QQ6
Procathepsin L
(Homo sapiens (Human))
BDBM50263611
(2-cyano-N-methyl-4-(spiro[3.5]nonan-7-ylmethylamin...)
Show SMILES CNC(=O)c1c(NCC2CCC3(CCC3)CC2)nc(nc1OC1CC(C)(C)NC(C)(C)C1)C#N
Show InChI InChI=1S/C26H40N6O2/c1-24(2)13-18(14-25(3,4)32-24)34-23-20(22(33)28-5)21(30-19(15-27)31-23)29-16-17-7-11-26(12-8-17)9-6-10-26/h17-18,32H,6-14,16H2,1-5H3,(H,28,33)(H,29,30,31)
Reactome pathway
n/an/a 1.39E+3n/an/an/an/an/an/a
Novartis Institutes for BioMedical Research
Curated by ChEMBL
Assay Description
Inhibition of human recombinant cathepsin L by fluorometric assay
Bioorg Med Chem Lett 18: 5280-4 (2008)
Article DOI: 10.1016/j.bmcl.2008.08.067
BindingDB Entry DOI: 10.7270/Q2736QQ6