BDBM50263731 CHEMBL4084568
SMILES: CC(=O)NCC1CN(Cc2ccccc2)c2ccccc2C1
InChI Key: InChIKey=ILBNCFZSWPRFJV-UHFFFAOYSA-N
Data: 2 KI  1 EC50
Activity Spreadsheet -- Enzyme Inhibition Constant Data from BindingDB
Found 3 hits for monomerid = 50263731
Trg + Lig
Ki
nM
ΔG°
kcal/mole
IC50
nM
Kd
nM
EC50/IC50
nM
koff
s-1
kon
M-1s-1
pHTemp
°C
Melatonin receptor
(Homo sapiens (Human))
BDBM50263731
(CHEMBL4084568)
Show SMILES CC(=O)NCC1CN(Cc2ccccc2)c2ccccc2C1
Show InChI InChI=1S/C19H22N2O/c1-15(22)20-12-17-11-18-9-5-6-10-19(18)21(14-17)13-16-7-3-2-4-8-16/h2-10,17H,11-14H2,1H3,(H,20,22)
Reactome pathway
1n/an/an/an/an/an/an/an/a
Universit£ degli Studi di Parma
Curated by ChEMBL
Assay Description
Displacement of 2-[125I]-Iodomelatonin from human MT2 receptor expressed in CHO cell membranes after 120 mins by filter binding method
J Med Chem 61: 3726-3737 (2018)
Article DOI: 10.1021/acs.jmedchem.8b00359
BindingDB Entry DOI: 10.7270/Q2GM89RS
Melatonin receptor
(Homo sapiens (Human))
BDBM50263731
(CHEMBL4084568)
Show SMILES CC(=O)NCC1CN(Cc2ccccc2)c2ccccc2C1
Show InChI InChI=1S/C19H22N2O/c1-15(22)20-12-17-11-18-9-5-6-10-19(18)21(14-17)13-16-7-3-2-4-8-16/h2-10,17H,11-14H2,1H3,(H,20,22)
Reactome pathway
59n/an/an/an/an/an/an/an/a
Universit£ degli Studi di Parma
Curated by ChEMBL
Assay Description
Intrinsic activity at human MT1 receptor expressed in CHO cell membranes after 1 hr by [35S]GTPgammaS binding assay
J Med Chem 61: 3726-3737 (2018)
Article DOI: 10.1021/acs.jmedchem.8b00359
BindingDB Entry DOI: 10.7270/Q2GM89RS
Melatonin receptor
(Homo sapiens (Human))
BDBM50263731
(CHEMBL4084568)
Show SMILES CC(=O)NCC1CN(Cc2ccccc2)c2ccccc2C1
Show InChI InChI=1S/C19H22N2O/c1-15(22)20-12-17-11-18-9-5-6-10-19(18)21(14-17)13-16-7-3-2-4-8-16/h2-10,17H,11-14H2,1H3,(H,20,22)
Reactome pathway
n/an/an/an/a 3n/an/an/an/a
Universit£ degli Studi di Parma
Curated by ChEMBL
Assay Description
Intrinsic activity at human MT2 receptor expressed in CHO cell membranes after 1 hr by [35S]GTPgammaS binding assay
J Med Chem 61: 3726-3737 (2018)
Article DOI: 10.1021/acs.jmedchem.8b00359
BindingDB Entry DOI: 10.7270/Q2GM89RS