BDBM50263854 CHEMBL4075034
SMILES: [H][C@@]12CCCN1C(=O)[C@H](Cc1ccc3ccccc3c1)NC(=O)[C@H](CCCNC(N)=N)N(C)C(=O)[C@H](CC(C)C)NC(=O)[C@@H](Cc1ccc(O)cc1)NC2=O
InChI Key: InChIKey=KCQYIJFLVKVRKG-OWIQAHIBSA-N
Data: 2 IC50
Activity Spreadsheet -- Enzyme Inhibition Constant Data from BindingDB
Found 2 hits for monomerid = 50263854
Trg + Lig
Ki
nM
ΔG°
kcal/mole
IC50
nM
Kd
nM
EC50/IC50
nM
koff
s-1
kon
M-1s-1
pHTemp
°C
C-X-C chemokine receptor type 4
(Homo sapiens (Human))
BDBM50263854
(CHEMBL4075034)
Show SMILES [H][C@@]12CCCN1C(=O)[C@H](Cc1ccc3ccccc3c1)NC(=O)[C@H](CCCNC(N)=N)N(C)C(=O)[C@H](CC(C)C)NC(=O)[C@@H](Cc1ccc(O)cc1)NC2=O |r|
Show InChI InChI=1S/C40H52N8O6/c1-24(2)20-31-38(53)47(3)33(10-6-18-43-40(41)42)36(51)46-32(23-26-12-15-27-8-4-5-9-28(27)21-26)39(54)48-19-7-11-34(48)37(52)44-30(35(50)45-31)22-25-13-16-29(49)17-14-25/h4-5,8-9,12-17,21,24,30-34,49H,6-7,10-11,18-20,22-23H2,1-3H3,(H,44,52)(H,45,50)(H,46,51)(H4,41,42,43)/t30-,31+,32+,33+,34+/m1/s1
n/an/a>3.00E+4n/an/an/an/an/an/a
Kyoto University
Curated by ChEMBL
Assay Description
Displacement of [125I]SDF-1alpha from CXCR4 (unknown origin) expressed in HEK293 cells after 1 hr by scintillation counting method
J Med Chem 61: 3745-3751 (2018)
Article DOI: 10.1021/acs.jmedchem.8b00336
BindingDB Entry DOI: 10.7270/Q23B62M5
C-X-C chemokine receptor type 7 (CXCR7)
(Homo sapiens (Human))
BDBM50263854
(CHEMBL4075034)
Show SMILES [H][C@@]12CCCN1C(=O)[C@H](Cc1ccc3ccccc3c1)NC(=O)[C@H](CCCNC(N)=N)N(C)C(=O)[C@H](CC(C)C)NC(=O)[C@@H](Cc1ccc(O)cc1)NC2=O |r|
Show InChI InChI=1S/C40H52N8O6/c1-24(2)20-31-38(53)47(3)33(10-6-18-43-40(41)42)36(51)46-32(23-26-12-15-27-8-4-5-9-28(27)21-26)39(54)48-19-7-11-34(48)37(52)44-30(35(50)45-31)22-25-13-16-29(49)17-14-25/h4-5,8-9,12-17,21,24,30-34,49H,6-7,10-11,18-20,22-23H2,1-3H3,(H,44,52)(H,45,50)(H,46,51)(H4,41,42,43)/t30-,31+,32+,33+,34+/m1/s1
n/an/a 2.00E+3n/an/an/an/an/an/a
Kyoto University
Curated by ChEMBL
Assay Description
Displacement of [125I]SDF-1alpha from ACKR3 (unknown origin) expressed in CHO cells after 1 hr by scintillation counting method
J Med Chem 61: 3745-3751 (2018)
Article DOI: 10.1021/acs.jmedchem.8b00336
BindingDB Entry DOI: 10.7270/Q23B62M5