BDBM50263981 CHEMBL4102116
SMILES: [H][C@@]12CCCN1C(=O)[C@H](Cc1ccc3ccccc3c1)NC(=O)[C@H](CCCNC(N)=O)N(C)C(=O)[C@H](CCCNC(N)=N)NC(=O)[C@@H](Cc1ccc(F)cc1)NC2=O
InChI Key: InChIKey=QTWZNLSSAHWSFG-WUXKFAKNSA-N
Data: 2 IC50
Activity Spreadsheet -- Enzyme Inhibition Constant Data from BindingDB
Found 2 hits for monomerid = 50263981
Trg + Lig
Ki
nM
ΔG°
kcal/mole
IC50
nM
Kd
nM
EC50/IC50
nM
koff
s-1
kon
M-1s-1
pHTemp
°C
C-X-C chemokine receptor type 7 (CXCR7)
(Homo sapiens (Human))
BDBM50263981
(CHEMBL4102116)
Show SMILES [H][C@@]12CCCN1C(=O)[C@H](Cc1ccc3ccccc3c1)NC(=O)[C@H](CCCNC(N)=O)N(C)C(=O)[C@H](CCCNC(N)=N)NC(=O)[C@@H](Cc1ccc(F)cc1)NC2=O |r|
Show InChI InChI=1S/C40H51FN10O6/c1-50-32(10-5-19-46-40(44)57)35(53)49-31(23-25-12-15-26-7-2-3-8-27(26)21-25)38(56)51-20-6-11-33(51)36(54)48-30(22-24-13-16-28(41)17-14-24)34(52)47-29(37(50)55)9-4-18-45-39(42)43/h2-3,7-8,12-17,21,29-33H,4-6,9-11,18-20,22-23H2,1H3,(H,47,52)(H,48,54)(H,49,53)(H4,42,43,45)(H3,44,46,57)/t29-,30+,31-,32-,33-/m0/s1
n/an/a 1.20E+3n/an/an/an/an/an/a
Kyoto University
Curated by ChEMBL
Assay Description
Displacement of [125I]SDF-1alpha from ACKR3 (unknown origin) expressed in CHO cells after 1 hr by scintillation counting method
J Med Chem 61: 3745-3751 (2018)
Article DOI: 10.1021/acs.jmedchem.8b00336
BindingDB Entry DOI: 10.7270/Q23B62M5
C-X-C chemokine receptor type 4
(Homo sapiens (Human))
BDBM50263981
(CHEMBL4102116)
Show SMILES [H][C@@]12CCCN1C(=O)[C@H](Cc1ccc3ccccc3c1)NC(=O)[C@H](CCCNC(N)=O)N(C)C(=O)[C@H](CCCNC(N)=N)NC(=O)[C@@H](Cc1ccc(F)cc1)NC2=O |r|
Show InChI InChI=1S/C40H51FN10O6/c1-50-32(10-5-19-46-40(44)57)35(53)49-31(23-25-12-15-26-7-2-3-8-27(26)21-25)38(56)51-20-6-11-33(51)36(54)48-30(22-24-13-16-28(41)17-14-24)34(52)47-29(37(50)55)9-4-18-45-39(42)43/h2-3,7-8,12-17,21,29-33H,4-6,9-11,18-20,22-23H2,1H3,(H,47,52)(H,48,54)(H,49,53)(H4,42,43,45)(H3,44,46,57)/t29-,30+,31-,32-,33-/m0/s1
n/an/a>3.00E+4n/an/an/an/an/an/a
Kyoto University
Curated by ChEMBL
Assay Description
Displacement of [125I]SDF-1alpha from CXCR4 (unknown origin) expressed in HEK293 cells after 1 hr by scintillation counting method
J Med Chem 61: 3745-3751 (2018)
Article DOI: 10.1021/acs.jmedchem.8b00336
BindingDB Entry DOI: 10.7270/Q23B62M5