BDBM50264004 CHEMBL4071592
SMILES: CN1[C@@H](CCCNC(N)=O)C(=O)N[C@@H](Cc2ccc3ccccc3c2)C(=O)N(C)[C@@H](Cc2csc3ccccc23)C(=O)N[C@H](Cc2ccc(O)cc2)C(=O)N[C@@H](CCCNC(N)=N)C1=O
InChI Key: InChIKey=JDUAHZJGIMRSCV-LIWUZWDESA-N
Data: 2 IC50
Activity Spreadsheet -- Enzyme Inhibition Constant Data from BindingDB
Found 2 hits for monomerid = 50264004
Trg + Lig
Ki
nM
ΔG°
kcal/mole
IC50
nM
Kd
nM
EC50/IC50
nM
koff
s-1
kon
M-1s-1
pHTemp
°C
Atypical chemokine receptor 3
(Homo sapiens (Human))
BDBM50264004
(CHEMBL4071592)
Show SMILES CN1[C@@H](CCCNC(N)=O)C(=O)N[C@@H](Cc2ccc3ccccc3c2)C(=O)N(C)[C@@H](Cc2csc3ccccc23)C(=O)N[C@H](Cc2ccc(O)cc2)C(=O)N[C@@H](CCCNC(N)=N)C1=O |r|
Show InChI InChI=1S/C47H56N10O7S/c1-56-38(13-8-22-52-47(50)64)42(60)55-37(25-29-15-18-30-9-3-4-10-31(30)23-29)45(63)57(2)39(26-32-27-65-40-14-6-5-11-34(32)40)43(61)54-36(24-28-16-19-33(58)20-17-28)41(59)53-35(44(56)62)12-7-21-51-46(48)49/h3-6,9-11,14-20,23,27,35-39,58H,7-8,12-13,21-22,24-26H2,1-2H3,(H,53,59)(H,54,61)(H,55,60)(H4,48,49,51)(H3,50,52,64)/t35-,36+,37-,38-,39-/m0/s1
n/an/a 1.00E+3n/an/an/an/an/an/a
Kyoto University
Curated by ChEMBL
Assay Description
Displacement of [125I]SDF-1alpha from ACKR3 (unknown origin) expressed in CHO cells after 1 hr by scintillation counting method
J Med Chem 61: 3745-3751 (2018)
Article DOI: 10.1021/acs.jmedchem.8b00336
BindingDB Entry DOI: 10.7270/Q23B62M5
C-X-C chemokine receptor type 4
(Homo sapiens (Human))
BDBM50264004
(CHEMBL4071592)
Show SMILES CN1[C@@H](CCCNC(N)=O)C(=O)N[C@@H](Cc2ccc3ccccc3c2)C(=O)N(C)[C@@H](Cc2csc3ccccc23)C(=O)N[C@H](Cc2ccc(O)cc2)C(=O)N[C@@H](CCCNC(N)=N)C1=O |r|
Show InChI InChI=1S/C47H56N10O7S/c1-56-38(13-8-22-52-47(50)64)42(60)55-37(25-29-15-18-30-9-3-4-10-31(30)23-29)45(63)57(2)39(26-32-27-65-40-14-6-5-11-34(32)40)43(61)54-36(24-28-16-19-33(58)20-17-28)41(59)53-35(44(56)62)12-7-21-51-46(48)49/h3-6,9-11,14-20,23,27,35-39,58H,7-8,12-13,21-22,24-26H2,1-2H3,(H,53,59)(H,54,61)(H,55,60)(H4,48,49,51)(H3,50,52,64)/t35-,36+,37-,38-,39-/m0/s1
n/an/a>3.00E+4n/an/an/an/an/an/a
Kyoto University
Curated by ChEMBL
Assay Description
Displacement of [125I]SDF-1alpha from CXCR4 (unknown origin) expressed in HEK293 cells after 1 hr by scintillation counting method
J Med Chem 61: 3745-3751 (2018)
Article DOI: 10.1021/acs.jmedchem.8b00336
BindingDB Entry DOI: 10.7270/Q23B62M5