BDBM50264050 CHEMBL4103175
SMILES: [H][C@@]12CCCN1C(=O)[C@H](Cc1ccc3ccccc3c1)NC(=O)[C@H](CCCNC(N)=N)N(C)C(=O)[C@]1([H])CCCN1C(=O)[C@@H](Cc1ccc(O)cc1)NC2=O
InChI Key: InChIKey=IHNPCMQXILBRLO-UZYORVLWSA-N
Data: 2 IC50
Activity Spreadsheet -- Enzyme Inhibition Constant Data from BindingDB
Found 2 hits for monomerid = 50264050
Trg + Lig
Ki
nM
ΔG°
kcal/mole
IC50
nM
Kd
nM
EC50/IC50
nM
koff
s-1
kon
M-1s-1
pHTemp
°C
C-X-C chemokine receptor type 7 (CXCR7)
(Homo sapiens (Human))
BDBM50264050
(CHEMBL4103175)
Show SMILES [H][C@@]12CCCN1C(=O)[C@H](Cc1ccc3ccccc3c1)NC(=O)[C@H](CCCNC(N)=N)N(C)C(=O)[C@]1([H])CCCN1C(=O)[C@@H](Cc1ccc(O)cc1)NC2=O |r|
Show InChI InChI=1S/C39H48N8O6/c1-45-31(9-4-18-42-39(40)41)34(49)43-30(23-25-12-15-26-7-2-3-8-27(26)21-25)36(51)46-19-5-10-32(46)35(50)44-29(22-24-13-16-28(48)17-14-24)37(52)47-20-6-11-33(47)38(45)53/h2-3,7-8,12-17,21,29-33,48H,4-6,9-11,18-20,22-23H2,1H3,(H,43,49)(H,44,50)(H4,40,41,42)/t29-,30+,31+,32+,33+/m1/s1
n/an/a 2.00E+3n/an/an/an/an/an/a
Kyoto University
Curated by ChEMBL
Assay Description
Displacement of [125I]SDF-1alpha from ACKR3 (unknown origin) expressed in CHO cells after 1 hr by scintillation counting method
J Med Chem 61: 3745-3751 (2018)
Article DOI: 10.1021/acs.jmedchem.8b00336
BindingDB Entry DOI: 10.7270/Q23B62M5
C-X-C chemokine receptor type 4
(Homo sapiens (Human))
BDBM50264050
(CHEMBL4103175)
Show SMILES [H][C@@]12CCCN1C(=O)[C@H](Cc1ccc3ccccc3c1)NC(=O)[C@H](CCCNC(N)=N)N(C)C(=O)[C@]1([H])CCCN1C(=O)[C@@H](Cc1ccc(O)cc1)NC2=O |r|
Show InChI InChI=1S/C39H48N8O6/c1-45-31(9-4-18-42-39(40)41)34(49)43-30(23-25-12-15-26-7-2-3-8-27(26)21-25)36(51)46-19-5-10-32(46)35(50)44-29(22-24-13-16-28(48)17-14-24)37(52)47-20-6-11-33(47)38(45)53/h2-3,7-8,12-17,21,29-33,48H,4-6,9-11,18-20,22-23H2,1H3,(H,43,49)(H,44,50)(H4,40,41,42)/t29-,30+,31+,32+,33+/m1/s1
n/an/a>3.00E+4n/an/an/an/an/an/a
Kyoto University
Curated by ChEMBL
Assay Description
Displacement of [125I]SDF-1alpha from CXCR4 (unknown origin) expressed in HEK293 cells after 1 hr by scintillation counting method
J Med Chem 61: 3745-3751 (2018)
Article DOI: 10.1021/acs.jmedchem.8b00336
BindingDB Entry DOI: 10.7270/Q23B62M5