BDBM50264220 2-(1,6-diphenyl-1H-imidazo[4,5-c]pyridine-4-carboxamido)acetic acid::CHEMBL522419
SMILES: OC(=O)CNC(=O)c1nc(cc2n(cnc12)-c1ccccc1)-c1ccccc1
InChI Key: InChIKey=WGYLKBODGCGXHY-UHFFFAOYSA-N
Data: 1 IC50
Activity Spreadsheet -- Enzyme Inhibition Constant Data from BindingDB
Found 1 hit for monomerid = 50264220
Trg + Lig
Ki
nM
ΔG°
kcal/mole
IC50
nM
Kd
nM
EC50/IC50
nM
koff
s-1
kon
M-1s-1
pHTemp
°C
Egl nine homolog 1
(Homo sapiens (Human))
BDBM50264220
(2-(1,6-diphenyl-1H-imidazo[4,5-c]pyridine-4-carbox...)
Show SMILES OC(=O)CNC(=O)c1nc(cc2n(cnc12)-c1ccccc1)-c1ccccc1
Show InChI InChI=1S/C21H16N4O3/c26-18(27)12-22-21(28)20-19-17(11-16(24-20)14-7-3-1-4-8-14)25(13-23-19)15-9-5-2-6-10-15/h1-11,13H,12H2,(H,22,28)(H,26,27)
Reactome pathway
n/an/a 3n/an/an/an/an/an/a
Amgen, Inc.
Curated by ChEMBL
Assay Description
Inhibition of PHD2 (unknown origin) by fluorescence energy transfer analysis
Bioorg Med Chem Lett 18: 5023-6 (2008)
Article DOI: 10.1016/j.bmcl.2008.08.012
BindingDB Entry DOI: 10.7270/Q2ZS2WB7