BDBM50264223 2-(1-phenyl-1H-benzo[d]imidazole-4-carboxamido)acetic acid::CHEMBL489155
SMILES: OC(=O)CNC(=O)c1cccc2n(cnc12)-c1ccccc1
InChI Key: InChIKey=AZLCNJNMRKWTND-UHFFFAOYSA-N
Data: 1 IC50
Activity Spreadsheet -- Enzyme Inhibition Constant Data from BindingDB
Found 1 hit for monomerid = 50264223
Trg + Lig
Ki
nM
ΔG°
kcal/mole
IC50
nM
Kd
nM
EC50/IC50
nM
koff
s-1
kon
M-1s-1
pHTemp
°C
Egl nine homolog 1
(Homo sapiens (Human))
BDBM50264223
(2-(1-phenyl-1H-benzo[d]imidazole-4-carboxamido)ace...)
Show SMILES OC(=O)CNC(=O)c1cccc2n(cnc12)-c1ccccc1
Show InChI InChI=1S/C16H13N3O3/c20-14(21)9-17-16(22)12-7-4-8-13-15(12)18-10-19(13)11-5-2-1-3-6-11/h1-8,10H,9H2,(H,17,22)(H,20,21)
Reactome pathway
n/an/a 730n/an/an/an/an/an/a
Amgen, Inc.
Curated by ChEMBL
Assay Description
Inhibition of PHD2 (unknown origin) by fluorescence energy transfer analysis
Bioorg Med Chem Lett 18: 5023-6 (2008)
Article DOI: 10.1016/j.bmcl.2008.08.012
BindingDB Entry DOI: 10.7270/Q2ZS2WB7