BDBM50264880 (trans)-4-((2-(4-((E)-3-morpholino-3-oxoprop-1-enyl)-2,3-bis(trifluoromethyl)phenylthio)phenoxy)methyl)cyclohexanecarboxylic acid::CHEMBL502756
SMILES: OC(=O)[C@H]1CC[C@H](COc2ccccc2Sc2ccc(\C=C\C(=O)N3CCOCC3)c(c2C(F)(F)F)C(F)(F)F)CC1
InChI Key: InChIKey=AXSOGTWJBSDWJQ-WDYYSVFXSA-N
Data: 1 IC50
Activity Spreadsheet -- Enzyme Inhibition Constant Data from BindingDB
Found 1 hit for monomerid = 50264880
Trg + Lig
Ki
nM
ΔG°
kcal/mole
IC50
nM
Kd
nM
EC50/IC50
nM
koff
s-1
kon
M-1s-1
pHTemp
°C
Integrin alpha-L/beta-2 (LFA-1)
(Homo sapiens (Human))
BDBM50264880
((trans)-4-((2-(4-((E)-3-morpholino-3-oxoprop-1-eny...)
Show SMILES OC(=O)[C@H]1CC[C@H](COc2ccccc2Sc2ccc(\C=C\C(=O)N3CCOCC3)c(c2C(F)(F)F)C(F)(F)F)CC1 |r,wU:6.6,wD:3.2,(-2.92,-34.03,;-4.25,-34.8,;-5.59,-34.04,;-4.24,-36.35,;-5.58,-37.13,;-5.57,-38.67,;-4.23,-39.42,;-4.23,-40.96,;-2.89,-41.73,;-2.89,-43.27,;-4.22,-44.04,;-4.22,-45.58,;-2.89,-46.35,;-1.55,-45.58,;-1.55,-44.03,;-.22,-43.26,;1.11,-44.02,;1.11,-45.56,;2.45,-46.32,;3.78,-45.55,;5.12,-46.31,;6.45,-45.53,;7.79,-46.3,;9.12,-45.52,;7.79,-47.84,;6.46,-48.6,;6.46,-50.13,;7.8,-50.91,;9.13,-50.13,;9.13,-48.59,;3.77,-44,;2.43,-43.24,;2.42,-41.7,;2.41,-40.16,;.88,-41.71,;3.96,-41.69,;5.1,-43.22,;6.42,-42.44,;5.88,-44.55,;5.09,-41.67,;-2.9,-38.66,;-2.9,-37.12,)|
Show InChI InChI=1S/C29H29F6NO5S/c30-28(31,32)25-19(10-12-24(37)36-13-15-40-16-14-36)9-11-23(26(25)29(33,34)35)42-22-4-2-1-3-21(22)41-17-18-5-7-20(8-6-18)27(38)39/h1-4,9-12,18,20H,5-8,13-17H2,(H,38,39)/b12-10+/t18-,20-
NCI pathway
Reactome pathway
n/an/a 0.600n/an/an/an/an/an/a
Biogen Idec Inc.
Curated by ChEMBL
Assay Description
Inhibition of recombinant LFA1/ICAM1-IG interaction (unknown origin) by time-resolved fluorimetry method
Bioorg Med Chem Lett 18: 5245-8 (2008)
Article DOI: 10.1016/j.bmcl.2008.08.062
BindingDB Entry DOI: 10.7270/Q23B5ZZ1