BDBM50264925 (S)-N-(2-(6-(2-acetamidobenzo[d]thiazol-4-yloxy)pyrimidin-4-yl)-5-(trifluoromethyl)phenyl)-1-isobutylpyrrolidine-2-carboxamide::CHEMBL445237
SMILES: CC(C)CN1CCC[C@H]1C(=O)Nc1cc(ccc1-c1cc(Oc2cccc3sc(NC(C)=O)nc23)ncn1)C(F)(F)F
InChI Key: InChIKey=GYHAPTAGIQVJLR-QFIPXVFZSA-N
Data: 1 IC50
Activity Spreadsheet -- Enzyme Inhibition Constant Data from BindingDB
Found 1 hit for monomerid = 50264925
Trg + Lig
Ki
nM
ΔG°
kcal/mole
IC50
nM
Kd
nM
EC50/IC50
nM
koff
s-1
kon
M-1s-1
pHTemp
°C
Vanilloid receptor
(Rattus norvegicus (rat))
BDBM50264925
((S)-N-(2-(6-(2-acetamidobenzo[d]thiazol-4-yloxy)py...)
Show SMILES CC(C)CN1CCC[C@H]1C(=O)Nc1cc(ccc1-c1cc(Oc2cccc3sc(NC(C)=O)nc23)ncn1)C(F)(F)F |r|
Show InChI InChI=1S/C29H29F3N6O3S/c1-16(2)14-38-11-5-6-22(38)27(40)36-21-12-18(29(30,31)32)9-10-19(21)20-13-25(34-15-33-20)41-23-7-4-8-24-26(23)37-28(42-24)35-17(3)39/h4,7-10,12-13,15-16,22H,5-6,11,14H2,1-3H3,(H,36,40)(H,35,37,39)/t22-/m0/s1
Reactome pathway
n/an/a 0.360n/an/an/an/an/an/a
Amgen Inc.
Curated by ChEMBL
Assay Description
Antagonist activity at rat TRPV1 expressed in CHO cells assessed as inhibition of capsaicin-induced 45Ca2+ influx by FLIPR assay
Bioorg Med Chem Lett 18: 5118-22 (2008)
Article DOI: 10.1016/j.bmcl.2008.07.112
BindingDB Entry DOI: 10.7270/Q27D2TXQ