BDBM50265438 6-((1H-imidazol-1-yl)(4-methoxyphenyl)methyl)benzo[d][1,3]dioxol-5-ol::CHEMBL522733::NSC-369087
SMILES: COc1ccc(cc1)C(c1cc2OCOc2cc1O)n1ccnc1
InChI Key: InChIKey=SLZWZNUKPMKGCR-UHFFFAOYSA-N
Data: 1 KI  1 IC50
Activity Spreadsheet -- Enzyme Inhibition Constant Data from BindingDB
Found 3 hits for monomerid = 50265438
Trg + Lig
Ki
nM
ΔG°
kcal/mole
IC50
nM
Kd
nM
EC50/IC50
nM
koff
s-1
kon
M-1s-1
pHTemp
°C
Cytochrome P450 19A1
(Homo sapiens (Human))
BDBM50265438
(6-((1H-imidazol-1-yl)(4-methoxyphenyl)methyl)benzo...)
Show SMILES COc1ccc(cc1)C(c1cc2OCOc2cc1O)n1ccnc1
Show InChI InChI=1S/C18H16N2O4/c1-22-13-4-2-12(3-5-13)18(20-7-6-19-10-20)14-8-16-17(9-15(14)21)24-11-23-16/h2-10,18,21H,11H2,1H3
Reactome pathway
13.1n/an/an/an/an/an/an/an/a
Universidade de Coimbra
Curated by ChEMBL
Assay Description
Inhibition of human aromatase-mediated conversion of [1beta3H]androstenedione to estrone by Lineweaver-Burk plot in presence of NADPH
J Med Chem 52: 143-50 (2009)
Article DOI: 10.1021/jm800945c
BindingDB Entry DOI: 10.7270/Q2SQ9080
Protein Disulfide-Isomerase (PDI)
(Homo sapiens (Human))
BDBM50265438
(6-((1H-imidazol-1-yl)(4-methoxyphenyl)methyl)benzo...)
Show SMILES COc1ccc(cc1)C(c1cc2OCOc2cc1O)n1ccnc1
Show InChI InChI=1S/C18H16N2O4/c1-22-13-4-2-12(3-5-13)18(20-7-6-19-10-20)14-8-16-17(9-15(14)21)24-11-23-16/h2-10,18,21H,11H2,1H3
Reactome pathway
n/an/a 620n/an/an/an/an/an/a
TBA
Citation and Details
Cytochrome P450 19A1
(Homo sapiens (Human))
BDBM50265438
(6-((1H-imidazol-1-yl)(4-methoxyphenyl)methyl)benzo...)
Show SMILES COc1ccc(cc1)C(c1cc2OCOc2cc1O)n1ccnc1
Show InChI InChI=1S/C18H16N2O4/c1-22-13-4-2-12(3-5-13)18(20-7-6-19-10-20)14-8-16-17(9-15(14)21)24-11-23-16/h2-10,18,21H,11H2,1H3
Reactome pathway
n/an/a 55n/an/an/an/an/an/a
Universidade de Coimbra
Curated by ChEMBL
Assay Description
Inhibition of human aromatase-mediated conversion of [1beta3H]androstenedione to estrone by liquid scintillation counting in presence of NADPH
J Med Chem 52: 143-50 (2009)
Article DOI: 10.1021/jm800945c
BindingDB Entry DOI: 10.7270/Q2SQ9080