BDBM50265646 CHEMBL498766::tert-Butyl-(2Z)-2-(6-methoxy-1-pentyl-2-oxo-1,2-dihydro-3Hindol-3-ylidene)hydrazinecarboxylate
SMILES: CCCCCN1C(=O)C(=NNC(=O)OC(C)(C)C)c2ccc(OC)cc12
InChI Key: InChIKey=FAIVNJOKQSMIES-UHFFFAOYSA-N
Data: 2 EC50
Activity Spreadsheet -- Enzyme Inhibition Constant Data from BindingDB
Found 2 hits for monomerid = 50265646
Trg + Lig
Ki
nM
ΔG°
kcal/mole
IC50
nM
Kd
nM
EC50/IC50
nM
koff
s-1
kon
M-1s-1
pHTemp
°C
Cannabinoid receptor 2
(Homo sapiens (Human))
BDBM50265646
(CHEMBL498766 | tert-Butyl-(2Z)-2-(6-methoxy-1-pent...)
Show SMILES CCCCCN1C(=O)C(=NNC(=O)OC(C)(C)C)c2ccc(OC)cc12 |w:9.9|
Show InChI InChI=1S/C19H27N3O4/c1-6-7-8-11-22-15-12-13(25-5)9-10-14(15)16(17(22)23)20-21-18(24)26-19(2,3)4/h9-10,12H,6-8,11H2,1-5H3,(H,21,24)
Reactome pathway
n/an/an/an/a 15.9n/an/an/an/a
The University of Texas M. D. Anderson Cancer Center
Curated by ChEMBL
Assay Description
Inverse agonist activity at human recombinant CB2 receptor expressed CHO cells membrane by [35S]GTPgamma binding assay
J Med Chem 52: 433-44 (2009)
Article DOI: 10.1021/jm801353p
BindingDB Entry DOI: 10.7270/Q20G3M2X
Cannabinoid receptor 1
(Homo sapiens (Human))
BDBM50265646
(CHEMBL498766 | tert-Butyl-(2Z)-2-(6-methoxy-1-pent...)
Show SMILES CCCCCN1C(=O)C(=NNC(=O)OC(C)(C)C)c2ccc(OC)cc12 |w:9.9|
Show InChI InChI=1S/C19H27N3O4/c1-6-7-8-11-22-15-12-13(25-5)9-10-14(15)16(17(22)23)20-21-18(24)26-19(2,3)4/h9-10,12H,6-8,11H2,1-5H3,(H,21,24)
NCI pathway
Reactome pathway
n/an/an/an/a>1.00E+4n/an/an/an/a
The University of Texas M. D. Anderson Cancer Center
Curated by ChEMBL
Assay Description
Inverse agonist activity at human recombinant CB1 receptor expressed CHO cells membrane by [35S]GTPgamma binding assay
J Med Chem 52: 433-44 (2009)
Article DOI: 10.1021/jm801353p
BindingDB Entry DOI: 10.7270/Q20G3M2X