BDBM50265667 1'-{4-[(4-Chlorophenyl)amino]-6,7-dimethoxyquinazolin-2-yl}-1,4'-bipiperidin-3-ol::CHEMBL496151
SMILES: COc1cc2nc(nc(Nc3ccc(Cl)cc3)c2cc1OC)N1CCC(CC1)N1CCCC(O)C1
InChI Key: InChIKey=AUZUCMHFUOGOFB-UHFFFAOYSA-N
Data: 3 IC50
Activity Spreadsheet -- Enzyme Inhibition Constant Data from BindingDB
Found 3 hits for monomerid = 50265667
Trg + Lig
Ki
nM
ΔG°
kcal/mole
IC50
nM
Kd
nM
EC50/IC50
nM
koff
s-1
kon
M-1s-1
pHTemp
°C
C-C chemokine receptor type 4 (CCR4)
(Homo sapiens (Human))
BDBM50265667
(1'-{4-[(4-Chlorophenyl)amino]-6,7-dimethoxyquinazo...)
Show SMILES COc1cc2nc(nc(Nc3ccc(Cl)cc3)c2cc1OC)N1CCC(CC1)N1CCCC(O)C1
Show InChI InChI=1S/C26H32ClN5O3/c1-34-23-14-21-22(15-24(23)35-2)29-26(30-25(21)28-18-7-5-17(27)6-8-18)31-12-9-19(10-13-31)32-11-3-4-20(33)16-32/h5-8,14-15,19-20,33H,3-4,9-13,16H2,1-2H3,(H,28,29,30)
n/an/a 85n/an/an/an/an/an/a
Astellas Pharma Inc.
Curated by ChEMBL
Assay Description
Antagonist activity at human CCR4 receptor expressed in mouse B300-19 cells assessed as CCL22-induced chemotaxis
Bioorg Med Chem 17: 64-73 (2008)
Article DOI: 10.1016/j.bmc.2008.11.020
BindingDB Entry DOI: 10.7270/Q21836BS
C-C chemokine receptor type 4
(Mus musculus)
BDBM50265667
(1'-{4-[(4-Chlorophenyl)amino]-6,7-dimethoxyquinazo...)
Show SMILES COc1cc2nc(nc(Nc3ccc(Cl)cc3)c2cc1OC)N1CCC(CC1)N1CCCC(O)C1
Show InChI InChI=1S/C26H32ClN5O3/c1-34-23-14-21-22(15-24(23)35-2)29-26(30-25(21)28-18-7-5-17(27)6-8-18)31-12-9-19(10-13-31)32-11-3-4-20(33)16-32/h5-8,14-15,19-20,33H,3-4,9-13,16H2,1-2H3,(H,28,29,30)
n/an/a 430n/an/an/an/an/an/a
Astellas Pharma Inc.
Curated by ChEMBL
Assay Description
Antagonist activity at mouse CCR4 receptor expressed in mouse B300-19 cells assessed as CCL22-induced chemotaxis
Bioorg Med Chem 17: 64-73 (2008)
Article DOI: 10.1016/j.bmc.2008.11.020
BindingDB Entry DOI: 10.7270/Q21836BS
C-C chemokine receptor type 4 (CCR4)
(Homo sapiens (Human))
BDBM50265667
(1'-{4-[(4-Chlorophenyl)amino]-6,7-dimethoxyquinazo...)
Show SMILES COc1cc2nc(nc(Nc3ccc(Cl)cc3)c2cc1OC)N1CCC(CC1)N1CCCC(O)C1
Show InChI InChI=1S/C26H32ClN5O3/c1-34-23-14-21-22(15-24(23)35-2)29-26(30-25(21)28-18-7-5-17(27)6-8-18)31-12-9-19(10-13-31)32-11-3-4-20(33)16-32/h5-8,14-15,19-20,33H,3-4,9-13,16H2,1-2H3,(H,28,29,30)
n/an/a 48n/an/an/an/an/an/a
Astellas Pharma Inc.
Curated by ChEMBL
Assay Description
Antagonist activity at human CCR4 receptor expressed in mouse B300-19 cells assessed as CCL22-induced chemotaxis
Bioorg Med Chem 17: 64-73 (2008)
Article DOI: 10.1016/j.bmc.2008.11.020
BindingDB Entry DOI: 10.7270/Q21836BS