BDBM50265808 (S)-3-(4-fluorophenyl)-N-(2-oxotetrahydrofuran-3-yl)propanamide::CHEMBL444924
SMILES: Fc1ccc(CCC(=O)N[C@H]2CCOC2=O)cc1
InChI Key: InChIKey=JWGPSBVZCVYNKJ-NSHDSACASA-N
Data: 1 IC50
Activity Spreadsheet -- Enzyme Inhibition Constant Data from BindingDB
Found 1 hit for monomerid = 50265808
Trg + Lig
Ki
nM
ΔG°
kcal/mole
IC50
nM
Kd
nM
EC50/IC50
nM
koff
s-1
kon
M-1s-1
pHTemp
°C
Transcriptional activator protein luxR
(Vibrio fischeri (strain ATCC 700601 / ES114))
BDBM50265808
((S)-3-(4-fluorophenyl)-N-(2-oxotetrahydrofuran-3-y...)
Show SMILES Fc1ccc(CCC(=O)N[C@H]2CCOC2=O)cc1 |r|
Show InChI InChI=1S/C13H14FNO3/c14-10-4-1-9(2-5-10)3-6-12(16)15-11-7-8-18-13(11)17/h1-2,4-5,11H,3,6-8H2,(H,15,16)/t11-/m0/s1
n/an/a 2.70E+3n/an/an/an/an/an/a
University of Wisconsin-Madison
Curated by ChEMBL
Assay Description
Antagonist activity at Vibrio fischeri ES114 LuxR receptor assessed as inhibition of OHHL-induced response by luciferase reporter gene assay
Bioorg Med Chem Lett 18: 5978-81 (2008)
Article DOI: 10.1016/j.bmcl.2008.07.089
BindingDB Entry DOI: 10.7270/Q2Q81CXX