BDBM50265917 4-((4-tert-butylphenyl)ethynyl)benzoic acid::CHEMBL457775
SMILES: CC(C)(C)c1ccc(cc1)C#Cc1ccc(cc1)C(O)=O
InChI Key: InChIKey=ODGSTXCQFQIDED-UHFFFAOYSA-N
Data: 3 EC50
Activity Spreadsheet -- Enzyme Inhibition Constant Data from BindingDB
Found 3 hits for monomerid = 50265917
Trg + Lig
Ki
nM
ΔG°
kcal/mole
IC50
nM
Kd
nM
EC50/IC50
nM
koff
s-1
kon
M-1s-1
pHTemp
°C
Retinoid X receptor gamma/retinoic acid receptor alpha
(Homo sapiens (Human))
BDBM50265917
(4-((4-tert-butylphenyl)ethynyl)benzoic acid | CHEM...)
Show SMILES CC(C)(C)c1ccc(cc1)C#Cc1ccc(cc1)C(O)=O
Show InChI InChI=1S/C19H18O2/c1-19(2,3)17-12-8-15(9-13-17)5-4-14-6-10-16(11-7-14)18(20)21/h6-13H,1-3H3,(H,20,21)
NCI pathway
Reactome pathway
n/an/an/an/a>1.00E+3n/an/an/an/a
INSERM
Curated by ChEMBL
Assay Description
Activity at human RARalpha ligand binding domain expressed in COS7 cells cotransfected with Gal4-DBD assessed as transcriptional activation after 16 ...
Bioorg Med Chem Lett 19: 489-92 (2008)
Article DOI: 10.1016/j.bmcl.2008.11.040
BindingDB Entry DOI: 10.7270/Q2GF0TC9
Retinoid receptor
(Homo sapiens (Human))
BDBM50265917
(4-((4-tert-butylphenyl)ethynyl)benzoic acid | CHEM...)
Show SMILES CC(C)(C)c1ccc(cc1)C#Cc1ccc(cc1)C(O)=O
Show InChI InChI=1S/C19H18O2/c1-19(2,3)17-12-8-15(9-13-17)5-4-14-6-10-16(11-7-14)18(20)21/h6-13H,1-3H3,(H,20,21)
Reactome pathway
n/an/an/an/a 10n/an/an/an/a
INSERM
Curated by ChEMBL
Assay Description
Activity at human RARgamma ligand binding domain expressed in COS7 cells cotransfected with Gal4-DBD assessed as transcriptional activation after 16 ...
Bioorg Med Chem Lett 19: 489-92 (2008)
Article DOI: 10.1016/j.bmcl.2008.11.040
BindingDB Entry DOI: 10.7270/Q2GF0TC9
Retinoid receptor
(Homo sapiens (Human))
BDBM50265917
(4-((4-tert-butylphenyl)ethynyl)benzoic acid | CHEM...)
Show SMILES CC(C)(C)c1ccc(cc1)C#Cc1ccc(cc1)C(O)=O
Show InChI InChI=1S/C19H18O2/c1-19(2,3)17-12-8-15(9-13-17)5-4-14-6-10-16(11-7-14)18(20)21/h6-13H,1-3H3,(H,20,21)
Reactome pathway
n/an/an/an/a 10n/an/an/an/a
INSERM
Curated by ChEMBL
Assay Description
Activity at human RARbeta ligand binding domain expressed in COS7 cells cotransfected with Gal4-DBD assessed as transcriptional activation after 16 h...
Bioorg Med Chem Lett 19: 489-92 (2008)
Article DOI: 10.1016/j.bmcl.2008.11.040
BindingDB Entry DOI: 10.7270/Q2GF0TC9