BDBM50266026 (S)-6-amino-2-((S)-4-((S)-2-amino-3-(4-hydroxy-2,6-dimethylphenyl)propanamido)-3-oxo-4,5-dihydro-1H-benzo[c]azepin-2(3H)-yl)-N-benzylhexanamide::CHEMBL449224
SMILES: Cc1cc(O)cc(C)c1C[C@H](N)C(=O)N[C@H]1Cc2ccccc2CN([C@@H](CCCCN)C(=O)NCc2ccccc2)C1=O
InChI Key: InChIKey=IAPCGFXZQBWWFU-CHQNGUEUSA-N
Data: 2 KI  1 IC50
Activity Spreadsheet -- Enzyme Inhibition Constant Data from BindingDB
Found 3 hits for monomerid = 50266026
Trg + Lig
Ki
nM
ΔG°
kcal/mole
IC50
nM
Kd
nM
EC50/IC50
nM
koff
s-1
kon
M-1s-1
pHTemp
°C
Mu-type opioid receptor
(Rattus norvegicus (rat))
BDBM50266026
((S)-6-amino-2-((S)-4-((S)-2-amino-3-(4-hydroxy-2,6...)
Show SMILES Cc1cc(O)cc(C)c1C[C@H](N)C(=O)N[C@H]1Cc2ccccc2CN([C@@H](CCCCN)C(=O)NCc2ccccc2)C1=O |r|
Show InChI InChI=1S/C34H43N5O4/c1-22-16-27(40)17-23(2)28(22)19-29(36)32(41)38-30-18-25-12-6-7-13-26(25)21-39(34(30)43)31(14-8-9-15-35)33(42)37-20-24-10-4-3-5-11-24/h3-7,10-13,16-17,29-31,40H,8-9,14-15,18-21,35-36H2,1-2H3,(H,37,42)(H,38,41)/t29-,30-,31-/m0/s1
Reactome pathway
10.1n/an/an/an/an/an/an/an/a
Vrije Universiteit Brussel
Curated by ChEMBL
Assay Description
Displacement of [3H]DAMGO from mu opioid receptor in Sprague-Dawley rat brain synaptosomal membranes
Bioorg Med Chem Lett 19: 433-7 (2008)
Article DOI: 10.1016/j.bmcl.2008.11.051
BindingDB Entry DOI: 10.7270/Q2K64HZ7
Opioid receptors; mu & delta
(Rattus norvegicus (rat))
BDBM50266026
((S)-6-amino-2-((S)-4-((S)-2-amino-3-(4-hydroxy-2,6...)
Show SMILES Cc1cc(O)cc(C)c1C[C@H](N)C(=O)N[C@H]1Cc2ccccc2CN([C@@H](CCCCN)C(=O)NCc2ccccc2)C1=O |r|
Show InChI InChI=1S/C34H43N5O4/c1-22-16-27(40)17-23(2)28(22)19-29(36)32(41)38-30-18-25-12-6-7-13-26(25)21-39(34(30)43)31(14-8-9-15-35)33(42)37-20-24-10-4-3-5-11-24/h3-7,10-13,16-17,29-31,40H,8-9,14-15,18-21,35-36H2,1-2H3,(H,37,42)(H,38,41)/t29-,30-,31-/m0/s1
Reactome pathway
290n/an/an/an/an/an/an/an/a
Vrije Universiteit Brussel
Curated by ChEMBL
Assay Description
Displacement of [3H]DPDPE from delta opioid receptor in Sprague-Dawley rat brain synaptosomal membranes
Bioorg Med Chem Lett 19: 433-7 (2008)
Article DOI: 10.1016/j.bmcl.2008.11.051
BindingDB Entry DOI: 10.7270/Q2K64HZ7
Mu-type opioid receptor
(GUINEA PIG)
BDBM50266026
((S)-6-amino-2-((S)-4-((S)-2-amino-3-(4-hydroxy-2,6...)
Show SMILES Cc1cc(O)cc(C)c1C[C@H](N)C(=O)N[C@H]1Cc2ccccc2CN([C@@H](CCCCN)C(=O)NCc2ccccc2)C1=O |r|
Show InChI InChI=1S/C34H43N5O4/c1-22-16-27(40)17-23(2)28(22)19-29(36)32(41)38-30-18-25-12-6-7-13-26(25)21-39(34(30)43)31(14-8-9-15-35)33(42)37-20-24-10-4-3-5-11-24/h3-7,10-13,16-17,29-31,40H,8-9,14-15,18-21,35-36H2,1-2H3,(H,37,42)(H,38,41)/t29-,30-,31-/m0/s1
n/an/a 3.27E+3n/an/an/an/an/an/a
Vrije Universiteit Brussel
Curated by ChEMBL
Assay Description
Agonist activity at mu opioid receptor in Hartley guinea pig assessed as inhibition of electrically evoked ileum contraction by GPI test
Bioorg Med Chem Lett 19: 433-7 (2008)
Article DOI: 10.1016/j.bmcl.2008.11.051
BindingDB Entry DOI: 10.7270/Q2K64HZ7