null
SMILES: Cc1cc(O)cc(C)c1C[C@H](N)C(=O)N[C@H]1Cc2ccccc2CNC1=O
InChI Key: InChIKey=QBXKIGHVYCRJPK-OALUTQOASA-N
Activity Spreadsheet -- Enzyme Inhibition Constant Data from BindingDB
Found 3 hits for monomerid = 50266056
Trg + Lig
Ki
nM
ΔG°
kcal/mole
IC50
nM
Kd
nM
EC50/IC50
nM
koff
s-1
kon
M-1s-1
pHTemp
°C
Mu-type opioid receptor
(Rattus norvegicus (rat))
BDBM50266056
((S)-2-amino-3-(4-hydroxy-2,6-dimethylphenyl)-N-((S...)
Show SMILES Cc1cc(O)cc(C)c1C[C@H](N)C(=O)N[C@H]1Cc2ccccc2CNC1=O |r|
Show InChI InChI=1S/C21H25N3O3/c1-12-7-16(25)8-13(2)17(12)10-18(22)20(26)24-19-9-14-5-3-4-6-15(14)11-23-21(19)27/h3-8,18-19,25H,9-11,22H2,1-2H3,(H,23,27)(H,24,26)/t18-,19-/m0/s1
Reactome pathway
12.4n/an/an/an/an/an/an/an/a
Vrije Universiteit Brussel
Curated by ChEMBL
Assay Description
Displacement of [3H]DAMGO from mu opioid receptor in Sprague-Dawley rat brain synaptosomal membranes
Bioorg Med Chem Lett 19: 433-7 (2008)
Article DOI: 10.1016/j.bmcl.2008.11.051
BindingDB Entry DOI: 10.7270/Q2K64HZ7
Delta-type opioid receptor
(Rattus norvegicus (rat))
BDBM50266056
((S)-2-amino-3-(4-hydroxy-2,6-dimethylphenyl)-N-((S...)
Show SMILES Cc1cc(O)cc(C)c1C[C@H](N)C(=O)N[C@H]1Cc2ccccc2CNC1=O |r|
Show InChI InChI=1S/C21H25N3O3/c1-12-7-16(25)8-13(2)17(12)10-18(22)20(26)24-19-9-14-5-3-4-6-15(14)11-23-21(19)27/h3-8,18-19,25H,9-11,22H2,1-2H3,(H,23,27)(H,24,26)/t18-,19-/m0/s1
Reactome pathway
368n/an/an/an/an/an/an/an/a
Vrije Universiteit Brussel
Curated by ChEMBL
Assay Description
Displacement of [3H]DPDPE from delta opioid receptor in Sprague-Dawley rat brain synaptosomal membranes
Bioorg Med Chem Lett 19: 433-7 (2008)
Article DOI: 10.1016/j.bmcl.2008.11.051
BindingDB Entry DOI: 10.7270/Q2K64HZ7
Mu-type opioid receptor
(GUINEA PIG)
BDBM50266056
((S)-2-amino-3-(4-hydroxy-2,6-dimethylphenyl)-N-((S...)
Show SMILES Cc1cc(O)cc(C)c1C[C@H](N)C(=O)N[C@H]1Cc2ccccc2CNC1=O |r|
Show InChI InChI=1S/C21H25N3O3/c1-12-7-16(25)8-13(2)17(12)10-18(22)20(26)24-19-9-14-5-3-4-6-15(14)11-23-21(19)27/h3-8,18-19,25H,9-11,22H2,1-2H3,(H,23,27)(H,24,26)/t18-,19-/m0/s1
n/an/a 631n/an/an/an/an/an/a
Vrije Universiteit Brussel
Curated by ChEMBL
Assay Description
Agonist activity at mu opioid receptor in Hartley guinea pig assessed as inhibition of electrically evoked ileum contraction by GPI test
Bioorg Med Chem Lett 19: 433-7 (2008)
Article DOI: 10.1016/j.bmcl.2008.11.051
BindingDB Entry DOI: 10.7270/Q2K64HZ7