BDBM50266200 (S)-2-(3-methoxyphenyl)-N-(2-oxotetrahydrofuran-3-yl)acetamide::CHEMBL459083
SMILES: COc1cccc(CC(=O)N[C@H]2CCOC2=O)c1
InChI Key: InChIKey=YHSZPLUYKGQKNS-NSHDSACASA-N
Data: 1 IC50
Activity Spreadsheet -- Enzyme Inhibition Constant Data from BindingDB
Found 1 hit for monomerid = 50266200
Trg + Lig
Ki
nM
ΔG°
kcal/mole
IC50
nM
Kd
nM
EC50/IC50
nM
koff
s-1
kon
M-1s-1
pHTemp
°C
Transcriptional activator protein luxR
(Vibrio fischeri (strain ATCC 700601 / ES114))
BDBM50266200
((S)-2-(3-methoxyphenyl)-N-(2-oxotetrahydrofuran-3-...)
Show SMILES COc1cccc(CC(=O)N[C@H]2CCOC2=O)c1 |r|
Show InChI InChI=1S/C13H15NO4/c1-17-10-4-2-3-9(7-10)8-12(15)14-11-5-6-18-13(11)16/h2-4,7,11H,5-6,8H2,1H3,(H,14,15)/t11-/m0/s1
n/an/a 2.50E+3n/an/an/an/an/an/a
University of Wisconsin-Madison
Curated by ChEMBL
Assay Description
Antagonist activity at Vibrio fischeri ES114 LuxR receptor assessed as inhibition of OHHL-induced response by luciferase reporter gene assay
Bioorg Med Chem Lett 18: 5978-81 (2008)
Article DOI: 10.1016/j.bmcl.2008.07.089
BindingDB Entry DOI: 10.7270/Q2Q81CXX