null
SMILES: Cc1[nH]c(C(=O)Nc2ccc(cc2)-n2nn[nH]c2=O)c(Cl)c1Cl
InChI Key: InChIKey=YDDKRKCQSIKAJD-UHFFFAOYSA-N
Activity Spreadsheet -- Enzyme Inhibition Constant Data from BindingDB
Found 1 hit for monomerid = 50266297
Trg + Lig
Ki
nM
ΔG°
kcal/mole
IC50
nM
Kd
nM
EC50/IC50
nM
koff
s-1
kon
M-1s-1
pHTemp
°C
DNA gyrase subunit A/B
(Escherichia coli (strain K12))
BDBM50266297
(CHEMBL4794217)
Show SMILES Cc1[nH]c(C(=O)Nc2ccc(cc2)-n2nn[nH]c2=O)c(Cl)c1Cl
Show InChI InChI=1S/C22H16BrN3O3/c1-11-9-17-18(25(3)22(29)24(17)2)10-16(11)26-20(27)13-6-4-5-12-15(23)8-7-14(19(12)13)21(26)28/h4-10H,1-3H3
n/an/a 77n/an/an/an/an/an/a
TBA
Citation and Details