null
SMILES: Oc1c(O)c2C(=O)c3ccccc3C(=O)c2cc1NS(=O)(=O)c1ccc(cc1)-c1ccc(Cl)cc1
InChI Key: InChIKey=LLHGUSJJGJYSJO-UHFFFAOYSA-N
Activity Spreadsheet -- Enzyme Inhibition Constant Data from BindingDB
Found 1 hit for monomerid = 50266303
Trg + Lig
Ki
nM
ΔG°
kcal/mole
IC50
nM
Kd
nM
EC50/IC50
nM
koff
s-1
kon
M-1s-1
pHTemp
°C
Phosphoglycerate mutase 1
(Homo sapiens (Human))
BDBM50266303
(CHEMBL4763924)
Show SMILES Oc1c(O)c2C(=O)c3ccccc3C(=O)c2cc1NS(=O)(=O)c1ccc(cc1)-c1ccc(Cl)cc1
Show InChI InChI=1S/C27H26N4O4/c1-15-13-22-23(29(3)27(35)28(22)2)14-21(15)31-25(33)18-6-4-5-17-20(30-11-9-16(32)10-12-30)8-7-19(24(17)18)26(31)34/h4-8,13-14,16,32H,9-12H2,1-3H3
n/an/a 140n/an/an/an/an/an/a
TBA
Citation and Details