BDBM50266326 CHEMBL4076603
SMILES: Cc1cc2n(C)c(=O)n(C)c2cc1N1C(=O)c2cccc3cc(N)cc(C1=O)c23
InChI Key: InChIKey=ZIQDIXVWQPULTM-UHFFFAOYSA-N
Data: 5 IC50
Activity Spreadsheet -- Enzyme Inhibition Constant Data from BindingDB
Found 1 hit for monomerid = 50266326
Trg + Lig
Ki
nM
ΔG°
kcal/mole
IC50
nM
Kd
nM
EC50/IC50
nM
koff
s-1
kon
M-1s-1
pHTemp
°C
Phosphoglycerate mutase 1
(Homo sapiens (Human))
BDBM50266326
(CHEMBL4782282)
Show SMILES Cc1cc2n(C)c(=O)n(C)c2cc1N1C(=O)c2cccc3cc(N)cc(C1=O)c23
Show InChI InChI=1S/C22H18N4O3/c1-11-7-17-18(25(3)22(29)24(17)2)10-16(11)26-20(27)14-6-4-5-12-8-13(23)9-15(19(12)14)21(26)28/h4-10H,23H2,1-3H3
n/an/a 2.86E+3n/an/an/an/an/an/a
TBA
Citation and Details