null
SMILES: COC(=O)[C@@H]1C[C@H](OC(C)=O)C(=O)[C@H]2[C@@]1(C)CC[C@H]1C(=O)O[C@@H](C[C@]21C)C(O)=O
InChI Key: InChIKey=YXEJHRMHRUGJGC-JCFRPGQJSA-N
Activity Spreadsheet -- Enzyme Inhibition Constant Data from BindingDB
Found 4 hits for monomerid = 50266358
Trg + Lig
Ki
nM
ΔG°
kcal/mole
IC50
nM
Kd
nM
EC50/IC50
nM
koff
s-1
kon
M-1s-1
pHTemp
°C
Kappa-type opioid receptor
(Homo sapiens (Human))
BDBM50266358
((2S,4aR,6aR,7R,9S,10aS,10bR)-9-acetoxy-7-(methoxyc...)
Show SMILES COC(=O)[C@@H]1C[C@H](OC(C)=O)C(=O)[C@H]2[C@@]1(C)CC[C@H]1C(=O)O[C@@H](C[C@]21C)C(O)=O |r|
Show InChI InChI=1S/C20H26O9/c1-9(21)28-12-7-11(17(25)27-4)19(2)6-5-10-18(26)29-13(16(23)24)8-20(10,3)15(19)14(12)22/h10-13,15H,5-8H2,1-4H3,(H,23,24)/t10-,11-,12-,13-,15-,19-,20-/m0/s1
Reactome pathway
55n/an/an/an/an/an/an/an/a
McLean Hospital
Curated by ChEMBL
Assay Description
Displacement of [3H]diprenorphine from human KOPR expressed in CHO cells
Bioorg Med Chem 17: 1370-80 (2009)
Article DOI: 10.1016/j.bmc.2008.12.012
BindingDB Entry DOI: 10.7270/Q25H7G4K
Mu-type opioid receptor
(Rattus norvegicus (rat))
BDBM50266358
((2S,4aR,6aR,7R,9S,10aS,10bR)-9-acetoxy-7-(methoxyc...)
Show SMILES COC(=O)[C@@H]1C[C@H](OC(C)=O)C(=O)[C@H]2[C@@]1(C)CC[C@H]1C(=O)O[C@@H](C[C@]21C)C(O)=O |r|
Show InChI InChI=1S/C20H26O9/c1-9(21)28-12-7-11(17(25)27-4)19(2)6-5-10-18(26)29-13(16(23)24)8-20(10,3)15(19)14(12)22/h10-13,15H,5-8H2,1-4H3,(H,23,24)/t10-,11-,12-,13-,15-,19-,20-/m0/s1
Reactome pathway
>1.00E+3n/an/an/an/an/an/an/an/a
McLean Hospital
Curated by ChEMBL
Assay Description
Binding affinity to rat MOPR expressed in CHO cells
Bioorg Med Chem 17: 1370-80 (2009)
Article DOI: 10.1016/j.bmc.2008.12.012
BindingDB Entry DOI: 10.7270/Q25H7G4K
Delta-type opioid receptor
(MOUSE)
BDBM50266358
((2S,4aR,6aR,7R,9S,10aS,10bR)-9-acetoxy-7-(methoxyc...)
Show SMILES COC(=O)[C@@H]1C[C@H](OC(C)=O)C(=O)[C@H]2[C@@]1(C)CC[C@H]1C(=O)O[C@@H](C[C@]21C)C(O)=O |r|
Show InChI InChI=1S/C20H26O9/c1-9(21)28-12-7-11(17(25)27-4)19(2)6-5-10-18(26)29-13(16(23)24)8-20(10,3)15(19)14(12)22/h10-13,15H,5-8H2,1-4H3,(H,23,24)/t10-,11-,12-,13-,15-,19-,20-/m0/s1
Reactome pathway
>1.00E+3n/an/an/an/an/an/an/an/a
McLean Hospital
Curated by ChEMBL
Assay Description
Binding affinity to mouse DOPR expressed in CHO cells
Bioorg Med Chem 17: 1370-80 (2009)
Article DOI: 10.1016/j.bmc.2008.12.012
BindingDB Entry DOI: 10.7270/Q25H7G4K
Kappa-type opioid receptor
(Homo sapiens (Human))
BDBM50266358
((2S,4aR,6aR,7R,9S,10aS,10bR)-9-acetoxy-7-(methoxyc...)
Show SMILES COC(=O)[C@@H]1C[C@H](OC(C)=O)C(=O)[C@H]2[C@@]1(C)CC[C@H]1C(=O)O[C@@H](C[C@]21C)C(O)=O |r|
Show InChI InChI=1S/C20H26O9/c1-9(21)28-12-7-11(17(25)27-4)19(2)6-5-10-18(26)29-13(16(23)24)8-20(10,3)15(19)14(12)22/h10-13,15H,5-8H2,1-4H3,(H,23,24)/t10-,11-,12-,13-,15-,19-,20-/m0/s1
Reactome pathway
n/an/an/an/a 167n/an/an/an/a
McLean Hospital
Curated by ChEMBL
Assay Description
Agonist activity at human KOPR expressed in CHO cells assessed as enhancenment of [35S]GTPgammaS binding
Bioorg Med Chem 17: 1370-80 (2009)
Article DOI: 10.1016/j.bmc.2008.12.012
BindingDB Entry DOI: 10.7270/Q25H7G4K