BDBM50266508 3-(benzo[d]thiazol-2-yl)-4-(3-hydroxyphenyl)but-3-enoate
SMILES: Oc1cccc(\C=C(/CC([O-])=O)c2nc3ccccc3s2)c1
InChI Key: InChIKey=BZUAEDSCKGHVFY-XYOKQWHBSA-M
Data: 1 IC50
Activity Spreadsheet -- Enzyme Inhibition Constant Data from BindingDB
Found 1 hit for monomerid = 50266508
Trg + Lig
Ki
nM
ΔG°
kcal/mole
IC50
nM
Kd
nM
EC50/IC50
nM
koff
s-1
kon
M-1s-1
pHTemp
°C
Trans-sialidase
(Trypanosoma cruzi)
BDBM50266508
(3-(benzo[d]thiazol-2-yl)-4-(3-hydroxyphenyl)but-3-...)
Show SMILES Oc1cccc(\C=C(/CC([O-])=O)c2nc3ccccc3s2)c1
Show InChI InChI=1S/C17H13NO3S/c19-13-5-3-4-11(9-13)8-12(10-16(20)21)17-18-14-6-1-2-7-15(14)22-17/h1-9,19H,10H2,(H,20,21)/p-1/b12-8+
n/an/a 5.20E+5n/an/an/an/an/an/a
University of Manchester
Curated by ChEMBL
Assay Description
Inhibition of Trypanosoma cruzi trans-Sialidase by TIA assay
Bioorg Med Chem Lett 19: 589-96 (2009)
Article DOI: 10.1016/j.bmcl.2008.12.065
BindingDB Entry DOI: 10.7270/Q2X92C7J