BDBM50266783 CHEMBL4086010
SMILES: Cl.NCc1ccnc(Oc2cccc(c2)C(=O)Nc2ccc(F)cc2)c1
InChI Key: InChIKey=RPTMISIWMXZWAU-UHFFFAOYSA-N
Data: 4 IC50
Activity Spreadsheet -- Enzyme Inhibition Constant Data from BindingDB
Found 4 hits for monomerid = 50266783
Trg + Lig
Ki
nM
ΔG°
kcal/mole
IC50
nM
Kd
nM
EC50/IC50
nM
koff
s-1
kon
M-1s-1
pHTemp
°C
Lysyl oxidase
(Homo sapiens (Human))
BDBM50266783
(CHEMBL4086010)
Show SMILES Cl.NCc1ccnc(Oc2cccc(c2)C(=O)Nc2ccc(F)cc2)c1
Show InChI InChI=1S/C19H16FN3O2/c20-15-4-6-16(7-5-15)23-19(24)14-2-1-3-17(11-14)25-18-10-13(12-21)8-9-22-18/h1-11H,12,21H2,(H,23,24)
Reactome pathway
n/an/a 1.80E+3n/an/an/an/an/an/a
PharmAkea Therapeutics
Curated by ChEMBL
Assay Description
Inhibition of human LOX expressed in HEK cells assessed as reduction of H2O2 production from oxidative deamination of DAP preincubated for 2 hrs foll...
J Med Chem 60: 4403-4423 (2017)
Article DOI: 10.1021/acs.jmedchem.7b00345
BindingDB Entry DOI: 10.7270/Q2QV3Q0K
Lysyl oxidase homolog 2
(Homo sapiens (Human))
BDBM50266783
(CHEMBL4086010)
Show SMILES Cl.NCc1ccnc(Oc2cccc(c2)C(=O)Nc2ccc(F)cc2)c1
Show InChI InChI=1S/C19H16FN3O2/c20-15-4-6-16(7-5-15)23-19(24)14-2-1-3-17(11-14)25-18-10-13(12-21)8-9-22-18/h1-11H,12,21H2,(H,23,24)
n/an/a 1.60E+3n/an/an/an/an/an/a
PharmAkea Therapeutics
Curated by ChEMBL
Assay Description
Inhibition of human LOXL2 expressed in CHO cells assessed as reduction of H2O2 production from oxidative deamination of DAP preincubated for 2 hrs fo...
J Med Chem 60: 4403-4423 (2017)
Article DOI: 10.1021/acs.jmedchem.7b00345
BindingDB Entry DOI: 10.7270/Q2QV3Q0K
Lysyl oxidase homolog 2
(Homo sapiens (Human))
BDBM50266783
(CHEMBL4086010)
Show SMILES Cl.NCc1ccnc(Oc2cccc(c2)C(=O)Nc2ccc(F)cc2)c1
Show InChI InChI=1S/C19H16FN3O2/c20-15-4-6-16(7-5-15)23-19(24)14-2-1-3-17(11-14)25-18-10-13(12-21)8-9-22-18/h1-11H,12,21H2,(H,23,24)
n/an/a 50n/an/an/an/an/an/a
PharmAkea Therapeutics
Curated by ChEMBL
Assay Description
Inhibition of human LOXL2 expressed in CHO cells assessed as reduction of H2O2 production from oxidative deamination of DAP preincubated for 2 hrs fo...
J Med Chem 60: 4403-4423 (2017)
Article DOI: 10.1021/acs.jmedchem.7b00345
BindingDB Entry DOI: 10.7270/Q2QV3Q0K
Lysyl oxidase homolog 2
(Homo sapiens (Human))
BDBM50266783
(CHEMBL4086010)
Show SMILES Cl.NCc1ccnc(Oc2cccc(c2)C(=O)Nc2ccc(F)cc2)c1
Show InChI InChI=1S/C19H16FN3O2/c20-15-4-6-16(7-5-15)23-19(24)14-2-1-3-17(11-14)25-18-10-13(12-21)8-9-22-18/h1-11H,12,21H2,(H,23,24)
n/an/a 130n/an/an/an/an/an/a
PharmAkea Therapeutics
Curated by ChEMBL
Assay Description
Inhibition of human LOXL2 expressed in CHO cells assessed as reduction of H2O2 production from oxidative deamination of DAP preincubated for 2 hrs fo...
J Med Chem 60: 4403-4423 (2017)
Article DOI: 10.1021/acs.jmedchem.7b00345
BindingDB Entry DOI: 10.7270/Q2QV3Q0K