null
SMILES: COc1ccc(F)c(c1)-c1ccc(Cc2ccc(cc2)N2C[C@H](C[C@H]2CC(O)=O)C(F)(F)F)c(C)c1
InChI Key: InChIKey=PKUNNSLPQXPQEP-GMAHTHKFSA-N
Activity Spreadsheet -- Enzyme Inhibition Constant Data from BindingDB
Found 5 hits for monomerid = 50267010
Trg + Lig
Ki
nM
ΔG°
kcal/mole
IC50
nM
Kd
nM
EC50/IC50
nM
koff
s-1
kon
M-1s-1
pHTemp
°C
Free fatty acid receptor 1
(Homo sapiens (Human))
BDBM50267010
(CHEMBL4082395)
Show SMILES COc1ccc(F)c(c1)-c1ccc(Cc2ccc(cc2)N2C[C@H](C[C@H]2CC(O)=O)C(F)(F)F)c(C)c1 |r|
Show InChI InChI=1S/C28H27F4NO3/c1-17-11-20(25-15-24(36-2)9-10-26(25)29)6-5-19(17)12-18-3-7-22(8-4-18)33-16-21(28(30,31)32)13-23(33)14-27(34)35/h3-11,15,21,23H,12-14,16H2,1-2H3,(H,34,35)/t21-,23-/m0/s1
45n/an/an/an/an/an/an/an/a
Bristol-Myers Squibb
Curated by ChEMBL
Assay Description
Binding affinity to human GPR40 expressed in HEK293 cell membranes after 1 hr by radioligand displacement based scintillation counting method
J Med Chem 60: 1417-1431 (2017)
Article DOI: 10.1021/acs.jmedchem.6b01559
BindingDB Entry DOI: 10.7270/Q25X2CD5
Free fatty acid receptor 1
(Mus musculus)
BDBM50267010
(CHEMBL4082395)
Show SMILES COc1ccc(F)c(c1)-c1ccc(Cc2ccc(cc2)N2C[C@H](C[C@H]2CC(O)=O)C(F)(F)F)c(C)c1 |r|
Show InChI InChI=1S/C28H27F4NO3/c1-17-11-20(25-15-24(36-2)9-10-26(25)29)6-5-19(17)12-18-3-7-22(8-4-18)33-16-21(28(30,31)32)13-23(33)14-27(34)35/h3-11,15,21,23H,12-14,16H2,1-2H3,(H,34,35)/t21-,23-/m0/s1
Reactome pathway
n/an/an/an/a 2.40E+3n/an/an/an/a
Bristol-Myers Squibb
Curated by ChEMBL
Assay Description
Agonist activity at GPR40 in mouse STC1 cells assessed as induction of GLP-1 secretion measured after 1 hr by HTRF assay
J Med Chem 60: 1417-1431 (2017)
Article DOI: 10.1021/acs.jmedchem.6b01559
BindingDB Entry DOI: 10.7270/Q25X2CD5
Free fatty acid receptor 1
(Mus musculus)
BDBM50267010
(CHEMBL4082395)
Show SMILES COc1ccc(F)c(c1)-c1ccc(Cc2ccc(cc2)N2C[C@H](C[C@H]2CC(O)=O)C(F)(F)F)c(C)c1 |r|
Show InChI InChI=1S/C28H27F4NO3/c1-17-11-20(25-15-24(36-2)9-10-26(25)29)6-5-19(17)12-18-3-7-22(8-4-18)33-16-21(28(30,31)32)13-23(33)14-27(34)35/h3-11,15,21,23H,12-14,16H2,1-2H3,(H,34,35)/t21-,23-/m0/s1
Reactome pathway
n/an/an/an/a 3.20E+3n/an/an/an/a
Bristol-Myers Squibb
Curated by ChEMBL
Assay Description
Agonist activity at GPR40 in mouse STC1 cells assessed as induction of GLP-1 secretion measured after 1 hr by HTRF assay
J Med Chem 60: 1417-1431 (2017)
Article DOI: 10.1021/acs.jmedchem.6b01559
BindingDB Entry DOI: 10.7270/Q25X2CD5
Free fatty acid receptor 1
(Homo sapiens (Human))
BDBM50267010
(CHEMBL4082395)
Show SMILES COc1ccc(F)c(c1)-c1ccc(Cc2ccc(cc2)N2C[C@H](C[C@H]2CC(O)=O)C(F)(F)F)c(C)c1 |r|
Show InChI InChI=1S/C28H27F4NO3/c1-17-11-20(25-15-24(36-2)9-10-26(25)29)6-5-19(17)12-18-3-7-22(8-4-18)33-16-21(28(30,31)32)13-23(33)14-27(34)35/h3-11,15,21,23H,12-14,16H2,1-2H3,(H,34,35)/t21-,23-/m0/s1
n/an/an/an/a 2.40E+3n/an/an/an/a
Bristol-Myers Squibb
Curated by ChEMBL
Assay Description
Agonist activity at human GPR40 transfected in HEK293 cells assessed as induction of cAMP accumulation incubated for 30 to 45 mins by HTRF assay
J Med Chem 60: 1417-1431 (2017)
Article DOI: 10.1021/acs.jmedchem.6b01559
BindingDB Entry DOI: 10.7270/Q25X2CD5
Free fatty acid receptor 1
(Homo sapiens (Human))
BDBM50267010
(CHEMBL4082395)
Show SMILES COc1ccc(F)c(c1)-c1ccc(Cc2ccc(cc2)N2C[C@H](C[C@H]2CC(O)=O)C(F)(F)F)c(C)c1 |r|
Show InChI InChI=1S/C28H27F4NO3/c1-17-11-20(25-15-24(36-2)9-10-26(25)29)6-5-19(17)12-18-3-7-22(8-4-18)33-16-21(28(30,31)32)13-23(33)14-27(34)35/h3-11,15,21,23H,12-14,16H2,1-2H3,(H,34,35)/t21-,23-/m0/s1
n/an/an/an/a 490n/an/an/an/a
Bristol-Myers Squibb
Curated by ChEMBL
Assay Description
Agonist activity at human GPR40 transfected in HEK293 cells assessed as induction of cAMP accumulation incubated for 30 to 45 mins by HTRF assay
J Med Chem 60: 1417-1431 (2017)
Article DOI: 10.1021/acs.jmedchem.6b01559
BindingDB Entry DOI: 10.7270/Q25X2CD5