BDBM50267028 CHEMBL4073525
SMILES: Cc1cc(OCc2ccccc2)ccc1Oc1ccc(cc1)N1C[C@H](C[C@H]1CC(O)=O)C(F)(F)F
InChI Key: InChIKey=MWAFJFIGMVKTHI-UNMCSNQZSA-N
Data: 1 KI  2 EC50
Activity Spreadsheet -- Enzyme Inhibition Constant Data from BindingDB
Found 3 hits for monomerid = 50267028
Trg + Lig
Ki
nM
ΔG°
kcal/mole
IC50
nM
Kd
nM
EC50/IC50
nM
koff
s-1
kon
M-1s-1
pHTemp
°C
Free fatty acid receptor 1
(Homo sapiens (Human))
BDBM50267028
(CHEMBL4073525)
Show SMILES Cc1cc(OCc2ccccc2)ccc1Oc1ccc(cc1)N1C[C@H](C[C@H]1CC(O)=O)C(F)(F)F |r|
Show InChI InChI=1S/C27H26F3NO4/c1-18-13-24(34-17-19-5-3-2-4-6-19)11-12-25(18)35-23-9-7-21(8-10-23)31-16-20(27(28,29)30)14-22(31)15-26(32)33/h2-13,20,22H,14-17H2,1H3,(H,32,33)/t20-,22-/m0/s1
10n/an/an/an/an/an/an/an/a
Bristol-Myers Squibb
Curated by ChEMBL
Assay Description
Agonist activity at human GPR40 expressed in CHO-A12 cells assessed as increase in intracellular calcium flux measured for 100 secs by FLIPR assay
J Med Chem 60: 1417-1431 (2017)
Article DOI: 10.1021/acs.jmedchem.6b01559
BindingDB Entry DOI: 10.7270/Q25X2CD5
Free fatty acid receptor 1
(Mus musculus)
BDBM50267028
(CHEMBL4073525)
Show SMILES Cc1cc(OCc2ccccc2)ccc1Oc1ccc(cc1)N1C[C@H](C[C@H]1CC(O)=O)C(F)(F)F |r|
Show InChI InChI=1S/C27H26F3NO4/c1-18-13-24(34-17-19-5-3-2-4-6-19)11-12-25(18)35-23-9-7-21(8-10-23)31-16-20(27(28,29)30)14-22(31)15-26(32)33/h2-13,20,22H,14-17H2,1H3,(H,32,33)/t20-,22-/m0/s1
Reactome pathway
n/an/an/an/a 1.50E+3n/an/an/an/a
Bristol-Myers Squibb
Curated by ChEMBL
Assay Description
Agonist activity at GPR40 in mouse STC1 cells assessed as induction of GLP-1 secretion measured after 1 hr by HTRF assay
J Med Chem 60: 1417-1431 (2017)
Article DOI: 10.1021/acs.jmedchem.6b01559
BindingDB Entry DOI: 10.7270/Q25X2CD5
Free fatty acid receptor 1
(Homo sapiens (Human))
BDBM50267028
(CHEMBL4073525)
Show SMILES Cc1cc(OCc2ccccc2)ccc1Oc1ccc(cc1)N1C[C@H](C[C@H]1CC(O)=O)C(F)(F)F |r|
Show InChI InChI=1S/C27H26F3NO4/c1-18-13-24(34-17-19-5-3-2-4-6-19)11-12-25(18)35-23-9-7-21(8-10-23)31-16-20(27(28,29)30)14-22(31)15-26(32)33/h2-13,20,22H,14-17H2,1H3,(H,32,33)/t20-,22-/m0/s1
n/an/an/an/a 120n/an/an/an/a
Bristol-Myers Squibb
Curated by ChEMBL
Assay Description
Agonist activity at human GPR40 expressed in CHO-A12 cells assessed as increase in intracellular calcium flux measured for 100 secs by FLIPR assay
J Med Chem 60: 1417-1431 (2017)
Article DOI: 10.1021/acs.jmedchem.6b01559
BindingDB Entry DOI: 10.7270/Q25X2CD5