BDBM50267354 (4-(4-chlorophenylsulfonyl)piperazin-1-yl)(cyclopropyl)methanone::CHEMBL477964
SMILES: Clc1ccc(cc1)S(=O)(=O)N1CCN(CC1)C(=O)C1CC1
InChI Key: InChIKey=NDGJQVSJFLPIKZ-UHFFFAOYSA-N
Data: 1 IC50  1 EC50
Activity Spreadsheet -- Enzyme Inhibition Constant Data from BindingDB
Found 2 hits for monomerid = 50267354
Trg + Lig
Ki
nM
ΔG°
kcal/mole
IC50
nM
Kd
nM
EC50/IC50
nM
koff
s-1
kon
M-1s-1
pHTemp
°C
Cannabinoid receptor 1
(Homo sapiens (Human))
BDBM50267354
((4-(4-chlorophenylsulfonyl)piperazin-1-yl)(cyclopr...)
Show SMILES Clc1ccc(cc1)S(=O)(=O)N1CCN(CC1)C(=O)C1CC1
Show InChI InChI=1S/C14H17ClN2O3S/c15-12-3-5-13(6-4-12)21(19,20)17-9-7-16(8-10-17)14(18)11-1-2-11/h3-6,11H,1-2,7-10H2
NCI pathway
Reactome pathway
n/an/a 3.50E+3n/an/an/an/an/an/a
Merck Research Laboratories
Curated by ChEMBL
Assay Description
Displacement of [3H]CP55940 from human recombinant CB1R expressed in CHO cells
J Med Chem 52: 2550-8 (2009)
Article DOI: 10.1021/jm900063x
BindingDB Entry DOI: 10.7270/Q2028RF8
Cannabinoid receptor 1
(Homo sapiens (Human))
BDBM50267354
((4-(4-chlorophenylsulfonyl)piperazin-1-yl)(cyclopr...)
Show SMILES Clc1ccc(cc1)S(=O)(=O)N1CCN(CC1)C(=O)C1CC1
Show InChI InChI=1S/C14H17ClN2O3S/c15-12-3-5-13(6-4-12)21(19,20)17-9-7-16(8-10-17)14(18)11-1-2-11/h3-6,11H,1-2,7-10H2
NCI pathway
Reactome pathway
n/an/an/an/a>1.00E+4n/an/an/an/a
Merck Research Laboratories
Curated by ChEMBL
Assay Description
Inverse agonist activity at human recombinant CB1R expressed in CHO cells assessed as increase in forskolin-stimulated cAMP level
J Med Chem 52: 2550-8 (2009)
Article DOI: 10.1021/jm900063x
BindingDB Entry DOI: 10.7270/Q2028RF8