BDBM50267451 4-(3-((3S,6S)-6-((S)-5-amino-1-(benzylamino)-1,5-dioxopentan-2-ylcarbamoyl)-4-oxo-1,2,3,4,6,7-hexahydroazepino[3,2,1-hi]indol-3-ylamino)-3-oxoprop-1-enyl)phenyl dihydrogen phosphate::CHEMBL449547
SMILES: NC(=O)CC[C@H](NC(=O)[C@@H]1Cc2cccc3CC[C@H](NC(=O)\C=C\c4ccc(OP(O)(O)=O)cc4)C(=O)N1c23)C(=O)NCc1ccccc1
InChI Key: InChIKey=QLDOOJBFNCPFFL-MEAKHWMCSA-N
Data: 1 IC50
Activity Spreadsheet -- Enzyme Inhibition Constant Data from BindingDB
Found 1 hit for monomerid = 50267451
Trg + Lig
Ki
nM
ΔG°
kcal/mole
IC50
nM
Kd
nM
EC50/IC50
nM
koff
s-1
kon
M-1s-1
pHTemp
°C
Signal transducer and activator of transcription 3
(Homo sapiens (Human))
BDBM50267451
(4-(3-((3S,6S)-6-((S)-5-amino-1-(benzylamino)-1,5-d...)
Show SMILES NC(=O)CC[C@H](NC(=O)[C@@H]1Cc2cccc3CC[C@H](NC(=O)\C=C\c4ccc(OP(O)(O)=O)cc4)C(=O)N1c23)C(=O)NCc1ccccc1 |r|
Show InChI InChI=1S/C34H36N5O9P/c35-29(40)17-16-26(32(42)36-20-22-5-2-1-3-6-22)38-33(43)28-19-24-8-4-7-23-12-15-27(34(44)39(28)31(23)24)37-30(41)18-11-21-9-13-25(14-10-21)48-49(45,46)47/h1-11,13-14,18,26-28H,12,15-17,19-20H2,(H2,35,40)(H,36,42)(H,37,41)(H,38,43)(H2,45,46,47)/b18-11+/t26-,27-,28-/m0/s1
n/an/a 162n/an/an/an/an/an/a
The University of Texas M. D. Anderson Cancer Center
Curated by ChEMBL
Assay Description
Inhibition of Stat3 (unknown origin) by fluorescence polarization assay
J Med Chem 52: 2429-42 (2009)
Article DOI: 10.1021/jm801491w
BindingDB Entry DOI: 10.7270/Q28C9W4V