BDBM50267455 4-(3-((3S,6S)-6-(3-carbamoylpyrrolidine-1-carbonyl)-4-oxo-1,2,3,4,6,7-hexahydroazepino[3,2,1-hi]indol-3-ylamino)-3-oxoprop-1-enyl)phenyl dihydrogen phosphate::CHEMBL515762
SMILES: NC(=O)C1CCN(C1)C(=O)[C@@H]1Cc2cccc3CC[C@H](NC(=O)\C=C\c4ccc(OP(O)(O)=O)cc4)C(=O)N1c23
InChI Key: InChIKey=HLAPTXCLBCSAJN-OXNOFQFRSA-N
Data: 1 IC50
Activity Spreadsheet -- Enzyme Inhibition Constant Data from BindingDB
Found 1 hit for monomerid = 50267455
Trg + Lig
Ki
nM
ΔG°
kcal/mole
IC50
nM
Kd
nM
EC50/IC50
nM
koff
s-1
kon
M-1s-1
pHTemp
°C
Signal transducer and activator of transcription 3
(Homo sapiens (Human))
BDBM50267455
(4-(3-((3S,6S)-6-(3-carbamoylpyrrolidine-1-carbonyl...)
Show SMILES NC(=O)C1CCN(C1)C(=O)[C@@H]1Cc2cccc3CC[C@H](NC(=O)\C=C\c4ccc(OP(O)(O)=O)cc4)C(=O)N1c23 |r|
Show InChI InChI=1S/C27H29N4O8P/c28-25(33)19-12-13-30(15-19)27(35)22-14-18-3-1-2-17-7-10-21(26(34)31(22)24(17)18)29-23(32)11-6-16-4-8-20(9-5-16)39-40(36,37)38/h1-6,8-9,11,19,21-22H,7,10,12-15H2,(H2,28,33)(H,29,32)(H2,36,37,38)/b11-6+/t19?,21-,22-/m0/s1
n/an/a 595n/an/an/an/an/an/a
The University of Texas M. D. Anderson Cancer Center
Curated by ChEMBL
Assay Description
Inhibition of Stat3 (unknown origin) by fluorescence polarization assay
J Med Chem 52: 2429-42 (2009)
Article DOI: 10.1021/jm801491w
BindingDB Entry DOI: 10.7270/Q28C9W4V