BDBM50267684 4-[Hydroxy(diphenyl)methyl]-1-(2-{[(2-methylphenyl)methyl]oxy}ethyl)-1-azoniabicyclo[2.2.2]octane::CHEMBL491246
SMILES: Cc1ccccc1COCC[N+]12CCC(CC1)(CC2)C(O)(c1ccccc1)c1ccccc1
InChI Key: InChIKey=VAPZLALZVFFBOU-UHFFFAOYSA-N
Data: 1 IC50
Activity Spreadsheet -- Enzyme Inhibition Constant Data from BindingDB
Found 1 hit for monomerid = 50267684
Trg + Lig
Ki
nM
ΔG°
kcal/mole
IC50
nM
Kd
nM
EC50/IC50
nM
koff
s-1
kon
M-1s-1
pHTemp
°C
Muscarinic acetylcholine receptor M3
(Homo sapiens (Human))
BDBM50267684
(4-[Hydroxy(diphenyl)methyl]-1-(2-{[(2-methylphenyl...)
Show SMILES Cc1ccccc1COCC[N+]12CCC(CC1)(CC2)C(O)(c1ccccc1)c1ccccc1
Show InChI InChI=1S/C30H36NO2/c1-25-10-8-9-11-26(25)24-33-23-22-31-19-16-29(17-20-31,18-21-31)30(32,27-12-4-2-5-13-27)28-14-6-3-7-15-28/h2-15,32H,16-24H2,1H3/q+1
Reactome pathway
n/an/a 1.30E+4n/an/an/an/an/an/a
GlaxoSmithKline
Curated by ChEMBL
Assay Description
Antagonist activity at human cloned muscarinic M3 receptor expressed in CHO cells assessed as inhibition of acetylcholine-induced calcium mobilizatio...
J Med Chem 52: 2493-505 (2009)
Article DOI: 10.1021/jm801601v
BindingDB Entry DOI: 10.7270/Q2H131X8