null
SMILES: C[C@]1(N)CC[C@@H](Nc2c(cnn3cc(cc23)-c2ccccc2)C(N)=O)C1(C)C
InChI Key: InChIKey=DIFGSGNUHRNWPK-GCJKJVERSA-N
PDB links: 1 PDB ID matches this monomer.
Activity Spreadsheet -- Enzyme Inhibition Constant Data from BindingDB
Found 8 hits for monomerid = 50267826
Trg + Lig
Ki
nM
ΔG°
kcal/mole
IC50
nM
Kd
nM
EC50/IC50
nM
koff
s-1
kon
M-1s-1
pHTemp
°C
Tyrosine-protein kinase JAK1
(Homo sapiens (Human))
BDBM50267826
(CHEMBL4096145)
Show SMILES C[C@]1(N)CC[C@@H](Nc2c(cnn3cc(cc23)-c2ccccc2)C(N)=O)C1(C)C |r|
Show InChI InChI=1S/C22H27N5O/c1-21(2)18(9-10-22(21,3)24)26-19-16(20(23)28)12-25-27-13-15(11-17(19)27)14-7-5-4-6-8-14/h4-8,11-13,18,26H,9-10,24H2,1-3H3,(H2,23,28)/t18-,22+/m1/s1
Reactome pathway
n/an/a 0.400n/an/an/an/an/an/a
Research and Development, Bristol-Myers Squibb Research and Development, P.O. Box 4000, Princeton, NJ 08543, USA. Electronic address: john.hynes@bms.com.
Curated by ChEMBL
Assay Description
Inhibition of GST-tagged JAK1 (unknown origin) after 3 hrs by Caliper assay
Bioorg Med Chem Lett 27: 3101-3106 (2017)
Article DOI: 10.1016/j.bmcl.2017.05.043
BindingDB Entry DOI: 10.7270/Q2G73H7V
Non-receptor tyrosine-protein kinase TYK2
(Homo sapiens (Human))
BDBM50267826
(CHEMBL4096145)
Show SMILES C[C@]1(N)CC[C@@H](Nc2c(cnn3cc(cc23)-c2ccccc2)C(N)=O)C1(C)C |r|
Show InChI InChI=1S/C22H27N5O/c1-21(2)18(9-10-22(21,3)24)26-19-16(20(23)28)12-25-27-13-15(11-17(19)27)14-7-5-4-6-8-14/h4-8,11-13,18,26H,9-10,24H2,1-3H3,(H2,23,28)/t18-,22+/m1/s1
n/an/a 7.5n/an/an/an/an/an/a
Research and Development, Bristol-Myers Squibb Research and Development, P.O. Box 4000, Princeton, NJ 08543, USA. Electronic address: john.hynes@bms.com.
Curated by ChEMBL
Assay Description
Inhibition of His-tagged TYK2 (unknown origin) after 3 hrs by Caliper assay
Bioorg Med Chem Lett 27: 3101-3106 (2017)
Article DOI: 10.1016/j.bmcl.2017.05.043
BindingDB Entry DOI: 10.7270/Q2G73H7V
Tyrosine-protein kinase JAK3
(Homo sapiens (Human))
BDBM50267826
(CHEMBL4096145)
Show SMILES C[C@]1(N)CC[C@@H](Nc2c(cnn3cc(cc23)-c2ccccc2)C(N)=O)C1(C)C |r|
Show InChI InChI=1S/C22H27N5O/c1-21(2)18(9-10-22(21,3)24)26-19-16(20(23)28)12-25-27-13-15(11-17(19)27)14-7-5-4-6-8-14/h4-8,11-13,18,26H,9-10,24H2,1-3H3,(H2,23,28)/t18-,22+/m1/s1
Reactome pathway
n/an/a 0.900n/an/an/an/an/an/a
Research and Development, Bristol-Myers Squibb Research and Development, P.O. Box 4000, Princeton, NJ 08543, USA. Electronic address: john.hynes@bms.com.
Curated by ChEMBL
Assay Description
Inhibition of JAK3 (unknown origin) using CSKtide as substrate after 30 mins in presence of [gamma33P]ATP by liquid scintillation counting method
Bioorg Med Chem Lett 27: 3101-3106 (2017)
Article DOI: 10.1016/j.bmcl.2017.05.043
BindingDB Entry DOI: 10.7270/Q2G73H7V
3D
3D Structure (crystal)
Potassium voltage-gated channel subfamily H member 2
(Homo sapiens (Human))
BDBM50267826
(CHEMBL4096145)
Show SMILES C[C@]1(N)CC[C@@H](Nc2c(cnn3cc(cc23)-c2ccccc2)C(N)=O)C1(C)C |r|
Show InChI InChI=1S/C22H27N5O/c1-21(2)18(9-10-22(21,3)24)26-19-16(20(23)28)12-25-27-13-15(11-17(19)27)14-7-5-4-6-8-14/h4-8,11-13,18,26H,9-10,24H2,1-3H3,(H2,23,28)/t18-,22+/m1/s1
Reactome pathway
n/an/a 300n/an/an/an/an/an/a
Research and Development, Bristol-Myers Squibb Research and Development, P.O. Box 4000, Princeton, NJ 08543, USA. Electronic address: john.hynes@bms.com.
Curated by ChEMBL
Assay Description
Inhibition of human ERG by patch clamp method
Bioorg Med Chem Lett 27: 3101-3106 (2017)
Article DOI: 10.1016/j.bmcl.2017.05.043
BindingDB Entry DOI: 10.7270/Q2G73H7V
Tyrosine-protein kinase JAK1/JAK3
(Homo sapiens (Human))
BDBM50267826
(CHEMBL4096145)
Show SMILES C[C@]1(N)CC[C@@H](Nc2c(cnn3cc(cc23)-c2ccccc2)C(N)=O)C1(C)C |r|
Show InChI InChI=1S/C22H27N5O/c1-21(2)18(9-10-22(21,3)24)26-19-16(20(23)28)12-25-27-13-15(11-17(19)27)14-7-5-4-6-8-14/h4-8,11-13,18,26H,9-10,24H2,1-3H3,(H2,23,28)/t18-,22+/m1/s1
n/an/a 200n/an/an/an/an/an/a
Research and Development, Bristol-Myers Squibb Research and Development, P.O. Box 4000, Princeton, NJ 08543, USA. Electronic address: john.hynes@bms.com.
Curated by ChEMBL
Assay Description
Inhibition of JAK1/JAK3 in human whole blood assessed as reduction in IL-2 induced IFN-gamma production after 18 hrs by ELISA
Bioorg Med Chem Lett 27: 3101-3106 (2017)
Article DOI: 10.1016/j.bmcl.2017.05.043
BindingDB Entry DOI: 10.7270/Q2G73H7V
3D
3D Structure (crystal)
Tyrosine-protein kinase JAK2
(Homo sapiens (Human))
BDBM50267826
(CHEMBL4096145)
Show SMILES C[C@]1(N)CC[C@@H](Nc2c(cnn3cc(cc23)-c2ccccc2)C(N)=O)C1(C)C |r|
Show InChI InChI=1S/C22H27N5O/c1-21(2)18(9-10-22(21,3)24)26-19-16(20(23)28)12-25-27-13-15(11-17(19)27)14-7-5-4-6-8-14/h4-8,11-13,18,26H,9-10,24H2,1-3H3,(H2,23,28)/t18-,22+/m1/s1
Reactome pathway
n/an/a 9n/an/an/an/an/an/a
Research and Development, Bristol-Myers Squibb Research and Development, P.O. Box 4000, Princeton, NJ 08543, USA. Electronic address: john.hynes@bms.com.
Curated by ChEMBL
Assay Description
Inhibition of GST-tagged JAK2 (unknown origin) after 3 hrs by Caliper assay
Bioorg Med Chem Lett 27: 3101-3106 (2017)
Article DOI: 10.1016/j.bmcl.2017.05.043
BindingDB Entry DOI: 10.7270/Q2G73H7V
Potassium voltage-gated channel subfamily H member 2
(Homo sapiens (Human))
BDBM50267826
(CHEMBL4096145)
Show SMILES C[C@]1(N)CC[C@@H](Nc2c(cnn3cc(cc23)-c2ccccc2)C(N)=O)C1(C)C |r|
Show InChI InChI=1S/C22H27N5O/c1-21(2)18(9-10-22(21,3)24)26-19-16(20(23)28)12-25-27-13-15(11-17(19)27)14-7-5-4-6-8-14/h4-8,11-13,18,26H,9-10,24H2,1-3H3,(H2,23,28)/t18-,22+/m1/s1
Reactome pathway
n/an/a 3.80E+3n/an/an/an/an/an/a
Research and Development, Bristol-Myers Squibb Research and Development, P.O. Box 4000, Princeton, NJ 08543, USA. Electronic address: john.hynes@bms.com.
Curated by ChEMBL
Assay Description
Inhibition of human ERG by flux-based assay
Bioorg Med Chem Lett 27: 3101-3106 (2017)
Article DOI: 10.1016/j.bmcl.2017.05.043
BindingDB Entry DOI: 10.7270/Q2G73H7V
Cytochrome P450 3A4
(Homo sapiens (Human))
BDBM50267826
(CHEMBL4096145)
Show SMILES C[C@]1(N)CC[C@@H](Nc2c(cnn3cc(cc23)-c2ccccc2)C(N)=O)C1(C)C |r|
Show InChI InChI=1S/C22H27N5O/c1-21(2)18(9-10-22(21,3)24)26-19-16(20(23)28)12-25-27-13-15(11-17(19)27)14-7-5-4-6-8-14/h4-8,11-13,18,26H,9-10,24H2,1-3H3,(H2,23,28)/t18-,22+/m1/s1
Reactome pathway
n/an/a 3.00E+3n/an/an/an/an/an/a
Research and Development, Bristol-Myers Squibb Research and Development, P.O. Box 4000, Princeton, NJ 08543, USA. Electronic address: john.hynes@bms.com.
Curated by ChEMBL
Assay Description
Inhibition of CYP3A4 (unknown origin)
Bioorg Med Chem Lett 27: 3101-3106 (2017)
Article DOI: 10.1016/j.bmcl.2017.05.043
BindingDB Entry DOI: 10.7270/Q2G73H7V