BDBM50267840 CHEMBL4062062
SMILES: C[C@]1(N)CC[C@@H](Nc2c(cnn3cc(cc23)-c2ccc(Cl)cc2)C(N)=O)C1(C)C
InChI Key: InChIKey=NJNZVVQYKKIDLH-GCJKJVERSA-N
Data: 4 IC50
Activity Spreadsheet -- Enzyme Inhibition Constant Data from BindingDB
Found 4 hits for monomerid = 50267840
Trg + Lig
Ki
nM
ΔG°
kcal/mole
IC50
nM
Kd
nM
EC50/IC50
nM
koff
s-1
kon
M-1s-1
pHTemp
°C
Tyrosine-protein kinase JAK2
(Homo sapiens (Human))
BDBM50267840
(CHEMBL4062062)
Show SMILES C[C@]1(N)CC[C@@H](Nc2c(cnn3cc(cc23)-c2ccc(Cl)cc2)C(N)=O)C1(C)C |r|
Show InChI InChI=1S/C22H26ClN5O/c1-21(2)18(8-9-22(21,3)25)27-19-16(20(24)29)11-26-28-12-14(10-17(19)28)13-4-6-15(23)7-5-13/h4-7,10-12,18,27H,8-9,25H2,1-3H3,(H2,24,29)/t18-,22+/m1/s1
Reactome pathway
n/an/a 15n/an/an/an/an/an/a
Research and Development, Bristol-Myers Squibb Research and Development, P.O. Box 4000, Princeton, NJ 08543, USA. Electronic address: john.hynes@bms.com.
Curated by ChEMBL
Assay Description
Inhibition of GST-tagged JAK2 (unknown origin) after 3 hrs by Caliper assay
Bioorg Med Chem Lett 27: 3101-3106 (2017)
Article DOI: 10.1016/j.bmcl.2017.05.043
BindingDB Entry DOI: 10.7270/Q2G73H7V
Non-receptor tyrosine-protein kinase TYK2
(Homo sapiens (Human))
BDBM50267840
(CHEMBL4062062)
Show SMILES C[C@]1(N)CC[C@@H](Nc2c(cnn3cc(cc23)-c2ccc(Cl)cc2)C(N)=O)C1(C)C |r|
Show InChI InChI=1S/C22H26ClN5O/c1-21(2)18(8-9-22(21,3)25)27-19-16(20(24)29)11-26-28-12-14(10-17(19)28)13-4-6-15(23)7-5-13/h4-7,10-12,18,27H,8-9,25H2,1-3H3,(H2,24,29)/t18-,22+/m1/s1
n/an/a 10n/an/an/an/an/an/a
Research and Development, Bristol-Myers Squibb Research and Development, P.O. Box 4000, Princeton, NJ 08543, USA. Electronic address: john.hynes@bms.com.
Curated by ChEMBL
Assay Description
Inhibition of His-tagged TYK2 (unknown origin) after 3 hrs by Caliper assay
Bioorg Med Chem Lett 27: 3101-3106 (2017)
Article DOI: 10.1016/j.bmcl.2017.05.043
BindingDB Entry DOI: 10.7270/Q2G73H7V
Tyrosine-protein kinase JAK1
(Homo sapiens (Human))
BDBM50267840
(CHEMBL4062062)
Show SMILES C[C@]1(N)CC[C@@H](Nc2c(cnn3cc(cc23)-c2ccc(Cl)cc2)C(N)=O)C1(C)C |r|
Show InChI InChI=1S/C22H26ClN5O/c1-21(2)18(8-9-22(21,3)25)27-19-16(20(24)29)11-26-28-12-14(10-17(19)28)13-4-6-15(23)7-5-13/h4-7,10-12,18,27H,8-9,25H2,1-3H3,(H2,24,29)/t18-,22+/m1/s1
Reactome pathway
n/an/a 0.900n/an/an/an/an/an/a
Research and Development, Bristol-Myers Squibb Research and Development, P.O. Box 4000, Princeton, NJ 08543, USA. Electronic address: john.hynes@bms.com.
Curated by ChEMBL
Assay Description
Inhibition of GST-tagged JAK1 (unknown origin) after 3 hrs by Caliper assay
Bioorg Med Chem Lett 27: 3101-3106 (2017)
Article DOI: 10.1016/j.bmcl.2017.05.043
BindingDB Entry DOI: 10.7270/Q2G73H7V
Tyrosine-protein kinase JAK3
(Homo sapiens (Human))
BDBM50267840
(CHEMBL4062062)
Show SMILES C[C@]1(N)CC[C@@H](Nc2c(cnn3cc(cc23)-c2ccc(Cl)cc2)C(N)=O)C1(C)C |r|
Show InChI InChI=1S/C22H26ClN5O/c1-21(2)18(8-9-22(21,3)25)27-19-16(20(24)29)11-26-28-12-14(10-17(19)28)13-4-6-15(23)7-5-13/h4-7,10-12,18,27H,8-9,25H2,1-3H3,(H2,24,29)/t18-,22+/m1/s1
Reactome pathway
n/an/a 0.800n/an/an/an/an/an/a
Research and Development, Bristol-Myers Squibb Research and Development, P.O. Box 4000, Princeton, NJ 08543, USA. Electronic address: john.hynes@bms.com.
Curated by ChEMBL
Assay Description
Inhibition of JAK3 (unknown origin) using CSKtide as substrate after 30 mins in presence of [gamma33P]ATP by liquid scintillation counting method
Bioorg Med Chem Lett 27: 3101-3106 (2017)
Article DOI: 10.1016/j.bmcl.2017.05.043
BindingDB Entry DOI: 10.7270/Q2G73H7V