BDBM50267930 CHEMBL4104190
SMILES: OCc1noc(n1)-c1ccc(nn1)N1CCC(CC1)(c1ccc(cc1)C(F)(F)F)C(F)(F)F
InChI Key: InChIKey=OUGTWLPOXLOZSB-UHFFFAOYSA-N
Data: 1 IC50
Activity Spreadsheet -- Enzyme Inhibition Constant Data from BindingDB
Found 1 hit for monomerid = 50267930
Trg + Lig
Ki
nM
ΔG°
kcal/mole
IC50
nM
Kd
nM
EC50/IC50
nM
koff
s-1
kon
M-1s-1
pHTemp
°C
Stearoyl-CoA desaturase 1
(Homo sapiens (Human))
BDBM50267930
(CHEMBL4104190)
Show SMILES OCc1noc(n1)-c1ccc(nn1)N1CCC(CC1)(c1ccc(cc1)C(F)(F)F)C(F)(F)F
Show InChI InChI=1S/C20H17F6N5O2/c21-19(22,23)13-3-1-12(2-4-13)18(20(24,25)26)7-9-31(10-8-18)16-6-5-14(28-29-16)17-27-15(11-32)30-33-17/h1-6,32H,7-11H2
n/an/a 2.30n/an/an/an/an/an/a
Pharmaceutical Research Division, Takeda Pharmaceutical Company Ltd., 26-1, Muraokahigashi 2-chome, Fujisawa, Kanagawa 251-8555, Japan. Electronic address: keisuke.imamura@takeda.com.
Curated by ChEMBL
Assay Description
Displacement of (5-(6-(10H-spiro(1-benzofuran-3,30-pyrrolidin)-10-yl)pyridazin-3-yl)-1,2,4-oxadiazol-3-yl)[3H2]methanol from SCD1 in human liver micr...
Bioorg Med Chem 25: 3768-3779 (2017)
Article DOI: 10.1016/j.bmc.2017.05.016
BindingDB Entry DOI: 10.7270/Q2Z60RJN